{"text_format":"1","workbook":"xlsx","n_sheets":16,"sheets":["Title","Instructions","Definitions","1a) Project Info","1b) Non-Inf Program Info","2) Model Inputs","3) Results","Journey Quality","Intersection Delay","Intersection Safety","Auto Accident Costs","Health - Absenteeism","Health - Reduced Mortality","Emissions","Final Calculations","PARAMETERS"],"not_rendered":{"charts":0,"images":10,"macros":0,"external_links":0,"defined_names":684,"comments":2,"pivot_tables":0},"unopened":[],"bounds":{"document_bytes":16777216,"sheet_cells":100000,"rows_first":2000,"rows_last":500,"rows_between":2000,"halvings":0,"cell_chars":16384,"cell_head_chars":4096},"cells_cut":0,"cells_raw":0,"read":"whole","date_system":"1900"}

{"sheet":"Title","index":0,"n_rows":29,"n_cols":3,"rows_kept":29,"cut":false,"hidden":false,"merged":[]}
["The column titles for this worksheet are in row 2. They span cells C2. The data spans cells A3 through C29. There is information in every cell for column A through C inclusive.  If you are not using a screen reader, you can press Alt + R, T for the Review Ribbon, Edit Comment to move to and open a Comment once you are on a cell with a Comment. When you are finished reading the Comment, press Escape to close the comment and return to the worksheet. If you are using the JAWS screen reader, press Ctrl + Shift + Apostrophe to get a list of Comments and their cell coordinates in the worksheet. Press Enter on the Comment you want to go to or Escape once you’ve read the Comment for a cell. You are returned to the workbook. Note that there is no keyboard command with JAWS to reread Comments or read Comments once you are on them in a cell. You must use the ability to list Comments in order to read them if you are using the JAWS screen reader."]
[null,null,"California Active Transportation\nBenefit/Cost Analysis Model for 2024 INFRA/RAISE Applications\n(Cal-B/C AT) Version 8.1"]
[]
[]
[]
[]
[]
[]
[]
[]
{"$rows_left_out":20}
{"sheet":"Instructions","index":1,"n_rows":0,"n_cols":0,"rows_kept":0,"cut":false,"hidden":false,"merged":[]}

{"sheet":"Definitions","index":2,"n_rows":35,"n_cols":6,"rows_kept":35,"cut":false,"hidden":false,"merged":[[14,2,14,10],[15,2,15,10],[18,2,18,10],[27,2,27,3],[27,4,27,5],[21,2,21,10],[26,1,26,10],[2,1,2,10],[5,2,5,10],[6,2,6,10],[7,2,7,10],[8,2,8,10],[9,2,9,10],[19,2,19,10],[22,2,22,10],[23,2,23,10],[20,2,20,10],[12,2,12,10],[13,2,13,10]]}
[]
[null,"Definitions"]
[null,"Several definitions require clarification in evaluating facility use, either improved existing or new facilities. This section provides definitions for terms that are used in this tool with respect to “trip types” and “user types). In addition, not all users benefit from projects in the same way. Definitions about benefit categories are elaborated upon below. Relevance of benefit categories depends on trip purpose and type of project (i.e., existing facility upgrade and new construction)."]
[]
[null,"Trip Types","Definitions"]
[null,"Trips","One-way travel to a destination for commuting, or other purposes and is assumed to counted for both directions of travel (and subsequently modeled) for a specific location.  "]
[null,"Roundtrips","Most trips have a return journey using the same mode and some can include other unlinked side trips. This \"roundtrip\" measure divides Trips by the average number of unlinked trips to determine the is used to identify the number of users that take trips."]
[null,"Existing Trips","Baseline trips, either on an existing facility or unmarked street, where the project will create a new facility with specific improvements"]
[null,"Induced Trips","Additional trips above the baseline that arise because of the improvements to existing or new facilities"]
[null,"Trip Forecasts","Forecasts are developed for existing facilities and new locations (if applicable), model users determine numbers of current and induced trips, and other characteristics (e.g., roundtrip probability, purpose, distance, etc.) "]
{"$rows_left_out":26}
{"sheet":"1a) Project Info","index":3,"n_rows":129,"n_cols":42,"rows_kept":129,"cut":false,"hidden":false,"merged":[[9,4,9,5],[89,22,89,32],[50,23,50,32],[53,24,53,28],[54,24,54,26],[54,27,54,28],[54,31,54,32],[6,37,6,42],[6,23,6,32],[45,22,45,32],[10,24,10,26],[9,24,9,28],[10,31,10,32],[10,27,10,28]]}
[]
[null,null,"District: ",null,"HQ",null,null,null,null,null,null,null,null,null,null,null,null,null,null,null,null,"Enter all project and program costs (in today's dollars) in the two tables shown below .  Costs during construction should be entered in the first row."]
[null,null,null,null,null,null,null,"EA:",null,null,null,null,null,null,null,null,null,null,null,null,null,"Project costs (including maintenance and operating costs) should be net of costs without project."]
[null,null,"PROJECT:",null,"Hypothetical Project",null,null,"PPNO:"]
[]
[]
[null,null,"1A","PROJECT AND SITE CHARACTERISTICS",null,null,null,null,null,null,null,null,"1D","GENERAL USER CHARACTERISTICS (BASED ON PROJECT LOCATION)",null,null,null,null,null,null,null,null,"1F","PROJECT COSTS AND REQUESTED FUNDS (enter in thousands of dollars)",null,null,null,null,null,null,null,null,null,null,null,null,"1H","DATA CHECKS - PROJECT LENGTH, DAILY TRIPS"]
[]
[null,null,"Type of Project",null,null,null,null,null,null,null,null,null,"Cycling",null,null,null,null,null,null,null,null,null,"Col. no."]
[null,null,null,null,"Existing facility upgrade only = 1 \nNew facility only, no existing facility work = 2\nExisting facility upgrade and new facility extension = 3",null,null,1,null,null,null,null,null,"Trip Purpose",null,null,"No Build","Build",null,null,null,null,null,null,"DIRECT PROJECT COSTS",null,null,null,null,null,null,"TOTAL COSTS (in dollars)",null,null,null,null,null,null,null,null,"No Build Project Length","Build Project Length"]
{"$rows_left_out":120}
{"sheet":"1b) Non-Inf Program Info","index":4,"n_rows":86,"n_cols":9,"rows_kept":86,"cut":false,"hidden":false,"merged":[]}
[]
[null,null,"District: ",null,{"$f":"'1a) Project Info'!E2","v":"HQ"}]
[null,null,null,null,null,null,null,"EA:",{"$f":"'1a) Project Info'!I3","v":0}]
[null,null,"PROJECT:",null,{"$f":"'1a) Project Info'!E4","v":"Hypothetical Project"},null,null,"PPNO:",{"$f":"'1a) Project Info'!I4","v":0}]
[]
[]
[null,null,"1I","NON-INFRASTRUCTURE PROGRAM CHARACTERISTICS"]
[]
[]
[null,null,"Programmatic Initiatives?",null,null,null,null,{"$f":"IF('1a) Project Info'!H21=1,\"Yes\",\"No\")","v":"No"}]
{"$rows_left_out":77}
{"sheet":"2) Model Inputs","index":5,"n_rows":166,"n_cols":20,"rows_kept":166,"cut":false,"hidden":false,"merged":[]}
[]
[]
[null,null,"2A",null,"ACTIVE TRANSPORTATION DAILY VOLUME INPUTS - CYCLING - Existing Facility Segment",null,null,null,null,null,null,null,null,"2E",null,"ACTIVE TRANSPORTATION DAILY VOLUME INPUTS - PEDESTRIAN - Existing Facility Segment"]
[]
[null,null,null,null,null,"Calculated \nby Model","Changed \nby User","Used for \nProj. Eval.","Reason for Change",null,null,null,null,null,null,null,"Calculated \nby Model","Changed \nby User","Used for \nProj. Eval.","Reason for Change"]
[null,null,"No Build - Cycling",null,null,null,null,null,null,null,null,null,null,"No Build - Pedestrian"]
[null,null,null,"Year 1",null,null,null,null,null,null,null,null,null,null,"Year 1"]
[null,null,null,null,"Annual Trips - Commuting",{"$f":"ADT1CycNBEX*PerCommCycNB*CycleDays","v":0},null,{"$f":"IF(ISNUMBER(G8),G8,F8)","v":0},null,null,null,null,null,null,null,"Annual Trips - Commuting",{"$f":"ADT1PedNBEX*PerCommPedNB*CycleDays","v":0},null,{"$f":"IF(ISNUMBER(R8),R8,Q8)","v":0}]
[null,null,null,null,"Annual Trips - Other Destinations",{"$f":"ADT1CycNBEX*PerODCycNB*CycleDays","v":0},null,0,null,null,null,null,null,null,null,"Annual Trips - Other Destinations",{"$f":"ADT1PedNBEX*PerODPedNB*WalkDays","v":0},null,0]
[null,null,null,null,"Annual Trips - Recreational",{"$f":"ADT1CycNBEX*PerRecCycNB*CycleDays","v":0},null,{"$f":"IF(ISNUMBER(G10),G10,F10)*RecBen","v":0},{"$f":"IF(RecBen=0,\"Recreational Users not Included in Benefits\",\"\")","v":"Recreational Users not Included in Benefits"},null,null,null,null,null,null,"Annual Trips - Recreational",{"$f":"ADT1PedNBEX*PerRecPedNB*WalkDays","v":0},null,{"$f":"IF(ISNUMBER(R10),R10,Q10)*RecBen","v":0},{"$f":"IF(RecBen=0,\"Recreational Users not Included in Benefits\",\"\")","v":"Recreational Users not Included in Benefits"}]
{"$rows_left_out":157}
{"sheet":"3) Results","index":6,"n_rows":36,"n_cols":18,"rows_kept":36,"cut":false,"hidden":false,"merged":[]}
[]
[null,"District: ",null,null,{"$f":"'1a) Project Info'!E2","v":"HQ"}]
[null,null,null,null,null,null,null,null,null,null,null,null,null,null,null,null,"EA:",{"$f":"'1a) Project Info'!I3","v":0}]
[null,"PROJECT:",null,null,{"$f":"ProjName","v":"Hypothetical Project"},null,null,null,null,null,null,null,null,null,null,null,"PPNO:",{"$f":"'1a) Project Info'!I4","v":0}]
[]
[]
[]
[null,null,null,3,"INVESTMENT ANALYSIS"]
[null,null,null,null,"SUMMARY RESULTS"]
[]
{"$rows_left_out":27}
{"sheet":"Journey Quality","index":7,"n_rows":165,"n_cols":26,"rows_kept":165,"cut":false,"hidden":false,"merged":[[19,2,19,5],[19,6,19,8],[19,13,19,16],[19,17,19,19],[20,2,20,5],[20,6,20,8],[20,13,20,16],[20,17,20,19],[51,2,51,5],[51,6,51,8],[51,13,51,16],[51,17,51,19],[52,2,52,5],[52,6,52,8],[52,13,52,16],[52,17,52,19],[80,2,80,10],[80,13,80,21],[85,2,85,5],[85,6,85,8],[85,13,85,16],[85,17,85,19],[86,2,86,5],[86,6,86,8],[86,13,86,16],[86,17,86,19],[116,1,116,10],[116,12,116,21],[153,6,153,7],[153,17,153,18],[121,2,121,5],[121,6,121,8],[121,13,121,16],[121,17,121,19],[122,2,122,5],[122,6,122,8],[122,13,122,16],[122,17,122,19]]}
[null,"Journey Quality Benefits"]
[]
[null,"This sheet calculates journey quality benefits for cyclists and pedestrians who travel to a destination. Recreational users are not included."]
[]
[null,"Formulas:"]
[]
[null,"Avg. Annual Trips = Avg. Daily Trips x Annual Days in Year, by purpose",null,null,null,null,null,"Value of Journey Quality =  Time-Value of Improvement  x  Avg. Value of Time "]
[null,"trips / yr. ",null,null,null,null,null,"       $ / year ",null,"$/hour  "]
[]
[null,"Time-Value of Imp. = (1 - Facility Preference Factor) x Distance per Trip (Mi.)  / Travel Speed (MPH) ",null,null,null,null,null,"Value of Journey Quality  for Induced trips applies rule of half"]
{"$rows_left_out":156}
{"sheet":"Intersection Delay","index":8,"n_rows":94,"n_cols":28,"rows_kept":94,"cut":false,"hidden":false,"merged":[[19,8,19,9],[20,8,20,9],[19,20,19,21],[20,20,20,21],[19,2,19,5],[20,2,20,5],[19,6,19,7],[20,6,20,7],[19,14,19,17],[20,14,20,17],[20,18,20,19],[19,18,19,19],[56,20,56,21],[57,2,57,5],[57,6,57,7],[57,8,57,9],[57,14,57,17],[57,18,57,19],[57,20,57,21],[56,2,56,5],[56,6,56,7],[56,8,56,9],[56,14,56,17],[56,18,56,19]]}
[null,"Intersection Delay Benefits"]
[]
[null,"This sheet calculates total reduction in intersection delay due to improvements at intersections on an existing bike/pedestrian facility."]
[]
[null,"Formulas:"]
[]
[null,"Avg. Annual Trips = Avg. Daily Trips x Annual Days in Year, by purpose",null,null,null,null,null,"Value of Time Savings =  Travel Time Reduction  x  Avg. Value of Time "]
[null,"trips / yr. ",null,null,null,null,null,"       $ / year ",null,"$/hour  "]
[]
[null,"Time Saved = # of intersections crossed per trip x time savings per intersection x Avg. Annual Trips",null,null,null,null,null,"Value of Journey Quality  for Induced trips applies rule of half"]
{"$rows_left_out":85}
{"sheet":"Intersection Safety","index":9,"n_rows":79,"n_cols":43,"rows_kept":79,"cut":false,"hidden":false,"merged":[[9,9,9,14],[6,9,6,14],[6,1,6,7],[9,1,9,7],[14,2,14,16],[14,19,14,33],[14,40,14,42],[19,27,19,30],[19,2,19,5],[19,6,19,9],[19,10,19,13],[19,19,19,22],[19,23,19,26],[77,10,77,11],[77,27,77,28],[20,27,20,30],[20,2,20,5],[20,6,20,9],[20,10,20,13],[20,19,20,22],[20,23,20,26]]}
[null,"Intersection Safety Benefits"]
[]
[null,"This sheet calculates safety benefits associated with intersection improvements along a bike/pedestrian facility."]
[]
[null,"Formulas:"]
[]
[null,"Baseline Ave. Ann. Accidents by Type = Sum of total Accidents by Type / Years of Accident Data",null,null,null,null,null,null,null,"Value of Accident Reduction by Type =  Reduced # of accidents by Type x Value of Accident by Type"]
[null,"Accidents / yr.",null,null,null,null,null,null,null,"       $ / year ",null,"$/accident"]
[]
[null,"Reduction in Acc. by Type = Crash Modification Factor(s) x Baseline Ave. Ann. Acc. by Type (see calculations, below)",null,null,null,null,null,null,null,"Value of Accident Reduction all types =  Sum of Value of Accidents by Type"]
{"$rows_left_out":70}
{"sheet":"Auto Accident Costs","index":10,"n_rows":47,"n_cols":8,"rows_kept":47,"cut":false,"hidden":false,"merged":[[14,2,14,7]]}
[null,"Accident Reduction Benefits"]
[]
[null,"This sheet calculates benefits of avoided accidents on highways due to a mode shift in trips to active transportation modes."]
[]
[null,"Formulas:"]
[]
[null,"Vehicle-Miles Traveled = Affected Length x Avg Volume / Vehicle Occupancy",null,null,null,null,"Transit Acc Cost = Veh-Miles x Acc Cost/Mile"]
[null,"veh-miles/yr.",null,"miles","vehicles/yr."]
[]
[null,"Hwy Acc Cost = (VMT x Rate x Cost/Mile) by Acc Type",null,null,null,null,"Transit Acc Cost/Mile from PARAMETERS"]
{"$rows_left_out":38}
{"sheet":"Health - Absenteeism","index":11,"n_rows":47,"n_cols":22,"rows_kept":47,"cut":false,"hidden":false,"merged":[[19,2,19,4],[20,2,20,4],[19,11,19,13],[20,11,20,13]]}
[null,"Health Benefits - Reduced Absenteeism"]
[]
[null,"This sheet calculates the benefits to employers of improved health of employees who use active transportation modes. Benefits are based on the value of reduced work absences."]
[]
[null,"Formulas:"]
[null,null,null,null,null,null,null,"Value of Short-Term Health = Reduced Days of Work Absences x  Avg. Value of Time per Day "]
[null,"Avg. Ann. Commuters = Avg. Daily Trips / Roundtrip Factor x Commuting Purpose (%) x  Annual Days",null,null,null,null,null,"       $ / year ",null,"# of days / year",null,"$ / day "]
[null,"# / year","#/day'             ","%","#",null,null,"Avg. Value of Time per Day, based on state average wage rate and 8 hour day"]
[]
[null,"Reduced Days of Work Absences = Avg. Ann. Commuters x Short-term sick leave coverage x Reduction in sick days",null,null,null,null,null,"Only applicable for induced riders"]
{"$rows_left_out":38}
{"sheet":"Health - Reduced Mortality","index":12,"n_rows":94,"n_cols":26,"rows_kept":94,"cut":false,"hidden":false,"merged":[[20,2,20,4],[20,5,20,7],[20,13,20,15],[20,16,20,18],[51,24,51,25],[14,24,14,25],[19,2,19,4],[19,5,19,7],[19,13,19,15],[19,16,19,18],[56,13,56,15],[56,16,56,18],[57,2,57,4],[57,5,57,7],[57,13,57,15],[57,16,57,18],[56,2,56,4],[56,5,56,7]]}
[null,"Health Benefits - Reduced Mortality"]
[]
[null,"This sheet calculates the benefits to cyclists and pedestrians for improved long-term health based on reduced risk of mortality."]
[]
[null,"Formulas:"]
[null,null,null,null,null,null,null,"Number of Expected Deaths in Age Group (Baseline) = Number of Users in Risk-Reducing Age Group * Death Rate (Group)"]
[null,"Number of Induced Users = Users With Project (Improved or New Facility) - Baseline Users (Existing and / or no Facility)",null,null,null,null,null,"# / yr. "]
[null,"# / yr. ",null,null,null,null,null,"Reduced Mortality Risk = Expected Deaths in Age Group * Mortality Risk Reduction (%), as function of annual trip miles"]
[null,null,null,null,null,null,null,"# / yr. "]
[null,"Number of Users in Risk-Reducing Age Group = Number of Induced Users * % of Users (by Mode) in Risk-reducing Age Group",null,null,null,null,null,"Value of Reduced Mortality = Reduced Number of Annual Deaths * Value of Life"]
{"$rows_left_out":85}
{"sheet":"Emissions","index":13,"n_rows":47,"n_cols":23,"rows_kept":47,"cut":false,"hidden":false,"merged":[[19,2,19,3],[20,2,20,3]]}
[null,"Emission Reduction Benefits"]
[]
[null,"This sheet calculates emissions benefits associated with reductions in automobile use due to increased cycling and walking."]
[]
[null,"Formulas:"]
[]
[null,"Vehicle-Miles Traveled = Affected Length x Avg. Annual Volume",null,null,null,null,null,"Veh Em Cost = (Veh-Miles x Rate x Cost/Mile) by Em Type"]
[null,"veh-miles/yr.",null,"miles","vehicles/yr."]
[]
[null," Hwy Emissions Cost = (VMT x Rate x Cost/Mile) by Emissions Type"]
{"$rows_left_out":38}
{"sheet":"Final Calculations","index":14,"n_rows":66,"n_cols":33,"rows_kept":66,"cut":false,"hidden":false,"merged":[[14,2,14,9],[21,21,23,21],[21,23,23,23],[21,20,23,20],[21,22,23,22],[21,2,23,2],[21,19,23,19],[21,3,23,3],[21,5,23,5],[21,4,23,4],[21,6,23,6],[21,13,23,13],[21,14,23,14],[21,15,23,15],[21,7,23,7],[21,8,23,8],[21,30,23,30],[21,24,23,24],[21,25,23,25],[21,26,23,26],[21,27,23,27],[21,29,23,29]]}
[null,"Final Calculations"]
[]
[null,"This sheet performs the final calculations before presenting the summary results."]
[null,"Both net present value and internal rate of return are calculated."]
[]
[]
[]
[]
[]
[]
{"$rows_left_out":57}
{"sheet":"PARAMETERS","index":15,"n_rows":219,"n_cols":145,"rows_kept":219,"cut":false,"hidden":false,"merged":[]}
[null,"Parameters"]
[]
[null,"This page contains all economic values and rate tables."]
[null,"To update economic values automatically, change \"Economic Update Factor.\"",null,null,null,null,null,null,null,null,null,null,null,null,null,null,null,null,null,null,null,null,null,null,null,null,null,null,null,null,null,"Travel Demand Tables",null,null,null,null,null,null,null,null,null,null,"Operating Cost Tables",null,null,null,null,null,null,"Accident Tables",null,null,null,null,null,null,null,null,null,null,null,null,null,null,null,null,"Emissions Tables",null,null,null,null,null,null,null,null,null,null,null,null,null,null,null,null,null,null,null,null,null,null,null,null,null,null,null,null,null,null,null,null,null,null,null,null,null,"Pavement Adjustments (used only for pavement projects)",null,null,null,null,null,null,null,null,null,null,null,null,null,"Weaving Adjustments (used only for freeway",null,null,null,null,null,null,"TMS Adjustments (used only for ramp metering, ramp metering signal coordination, incident",null,null,null,null,null,null,null,null,null,null,null,null,"Reliability Tables (used for calculating travel time reliability "]
[null,null,null,null,null,null,null,null,null,null,null,null,null,null,null,null,null,null,null,null,null,null,null,null,null,null,null,null,null,null,null,null,null,null,null,null,null,null,null,null,null,null,null,null,null,null,null,null,null,null,null,null,null,null,null,null,null,null,null,null,null,null,null,null,null,null,null,null,null,null,null,null,null,null,null,null,null,null,null,null,null,null,null,null,null,null,null,null,null,null,null,null,null,null,null,null,null,null,null,null,null,null,null,null,null,null,null,null,null,null,null,null,null,null,null,null,null,null,"connector, HOV connector, and HOV drop ramp projects)",null,null,null,null,null,null,"management, traveler information projects, AVL, transit priority, and BRT projects)",null,null,null,null,null,null,null,null,null,null,null,null,"impacts if included)"]
[]
[null,"General Economic Parameters",null,null,null,null,null,null,"Mode Types",null,null,null,null,null,null,null,null,null,null,null,null,null,null,null,"Project Types"]
[null,null,null,null,null,null,null,null,null,null,null,null,null,null,null,null,null,null,null,null,null,null,null,null,null,null,null,null,null,null,null,null,"DEMAND FOR TRAVEL IN PEAK PERIOD",null,null,null,null,null,null,null,null,null,null,"FUEL CONSUMPTION RATES",null,null,null,null,null,null,"HIGHWAY INJURY SEVERITY FREQUENCY",null,null,null,null,null,null,null,"RATES FOR NON-HIGHWAY ACCIDENT EVENTS",null,null,null,null,null,null,null,null,"HIGHWAY EMISSIONS FACTORS (g/mi)",null,null,null,null,null,null,null,null,null,null,null,"HIGHWAY EMISSIONS FACTORS (g/mi)",null,null,null,null,null,null,null,null,null,null,null,null,"HEALTH COST OF TRANSPORTATION EMISSIONS",null,null,null,null,null,null,null,null,null,null,null,null,"PAVEMENT DETERIORATION",null,null,null,null,null,null,"VEHICLE OPERATING SPEED",null,null,null,null,null,null,"VEHICLE OPERATING SPEED",null,null,null,null,null,null,"PEAK PERIOD SPEED, VOLUME, AND NON-HIGHWAY BENEFITS",null,null,null,null,null,null,null,null,null,null,null,null,"C11 RELIABILITY PARAMETERS"]
[null,null,"Year of Current Dollars for Model",null,null,2022,null,null,null,"Bus",null,null,null,null,null,null,null,null,null,null,null,null,null,null,null,"Highway Capacity Expansion",null,null,"Please select a type of highway project",null,null,null,"(percent of total daily travel)",null,null,null,null,null,null,null,null,null,null,"(gal/veh-mi)",null,null,null,null,null,null,"(percent of injuries)",null,null,null,null,null,null,null,"(events/million veh-mi)",null,null,null,null,null,null,null,null,"Model Year 2024",null,null,null,null,null,null,null,null,null,null,null,"Model Year 2044",null,null,null,null,null,null,null,null,null,null,null,null,"($/ton)",null,null,null,null,null,null,null,null,null,null,null,null,"(IRI in inches/mile)",null,null,null,null,null,null,"(percent adjustment)",null,null,null,null,null,null,"(percent adjustment)",null,null,null,null,null,null,"(percent adjustment)",null,null,null,null,null,null,null,null,null,null,null,null,"(coefficients for standard deviation calculations)"]
[null,null,"Economic Update Factor (Using GDP Deflator)",null,null,1.0692875944637901,null,1,null,"Pass Train",null,null,null,null,null,null,null,null,null,null,null,null,null,null,null,"    General Highway",null,"GenHwy"]
{"$rows_left_out":209}