{"text_format":"1","workbook":"xlsx","n_sheets":8,"sheets":["LotInfo","QCData","Verification","F Table","TCrit","Imported QCData","Reconditiondata","Beta PWL Calculation"],"not_rendered":{"charts":10,"images":1,"macros":1,"external_links":0,"defined_names":141,"comments":2,"pivot_tables":0},"unopened":[],"bounds":{"document_bytes":16777216,"sheet_cells":100000,"rows_first":2000,"rows_last":500,"rows_between":2000,"halvings":0,"cell_chars":16384,"cell_head_chars":4096},"cells_cut":0,"cells_raw":0,"read":"whole","date_system":"1900"}

{"sheet":"LotInfo","index":0,"n_rows":368,"n_cols":54,"rows_kept":368,"cut":false,"hidden":false,"merged":[]}
["LotInfo Worksheet",null,null,null,null,null,null,"Contractor QC Mgr Job #",null,null,null,null,"Enter Lot Number:"]
[]
["BETA PWL Spreadsheet (SPFPay):    For use with Caltrans Statistical Pay Factor (SPF) Specifications ",null,null,null,null,null,null,null,null,null,null,null,null,null,null,null,null,"© 2020 California Department of Transportation"]
["(Always visit the website below and use the most recent version of this spreadsheet.)",null,null,null,null,null,null,null,null,null,null,null,null,null,"Vers 1.02  issued 6/30/2020"]
["https://dot.ca.gov/programs/construction/hot-mix-asphalt-construction",null,null,null,null,null,null,"Project Name:"]
[null,"for version update history see cell B100",null,null,null,null,null,"EA (or Project ID):",null,null,null,"Contractor:"]
[null,"Need help w/ setting \"Trusted Folders\"? See cell BA100",null,null,null,null,null,"JMF No.",null,null,null,"HMA Plant:"]
[null,null,null,null,null,null,null,"Co/Rte/PM:",null,null,null,"QC Manager:"]
[null,null,null,null,null,null,null,null,null,null,null,"Resident Engineer:"]
[null,null,null,null,null,null,null,"HMA Type:",null,"3/4\" HMA Type A",null,"QC Lab:"]
[null,null,null,null,null,null,null,null,null,null,null,null,"Item Price:"]
[null,null,null,null,null,null,null,"Projects Specified PG Grade:",null,null,null,null,"Bid Item #"]
[null,null,null,null,null,null,null,"PG Grade used in JMF:",null,null,null,null,null,null,null,null,null,null,"(Enter data into the underlined unprotected cells to the left)",null,null,null,null,null,null,null,null,null,null,null,null,null,null,null,null,null,null,null,null,null,null,null,null,null,null,null,null,null,null,null,null,null," "]
[null,null,null,null,null,null,null,{"$f":"IF(OR(hmatype=mixa1,hmatype=mixa2,hmatype=mixb1,hmatype=mixb2,hmatype=mixc1),\"%RAP Agg in Agg Blend:\",\"\")","v":"%RAP Agg in Agg Blend:"},null,{"$f":"IF(OR(hmatype=mixa1,hmatype=mixa2,hmatype=mixb1,hmatype=mixb2,hmatype=mixc1),\"%  (Type A HMA Only)\",\"\")","v":"%  (Type A HMA Only)"}]
[null,null,null,null,"`"]
[null,null,null,null,null,null,null,"Binder Source:"]
[null,null,null,null,null,null,null,"Add'l Binder Desc:"]
[]
[]
[]
[]
[]
[]
[]
[null,"Quality Characteristic","2\"","1-1/2\"","1\"","3/4\"","1/2\"","3/8\"","#4","#8","#16","#30","#50","#100","#200","B.C.","%MTD","% Air Voids"]
[null,"Max JMF Target Value",{"$f":"_tvu2","v":100},{"$f":"_tvu3","v":100},{"$f":"_tvu4","v":100},{"$f":"_tvu5","v":98},{"$f":"_tvu6","v":90},{"$f":"_tvu7","v":90},{"$f":"_tvu8","v":58},{"$f":"_tvu9","v":43},{"$f":"_tvu10","v":43},{"$f":"_tvu11","v":23},{"$f":"_tvu12","v":23},{"$f":"_tvu13","v":23},{"$f":"_tvu14","v":7}]
[null,"Target Value",null,null,null,null,null,null,null,null,null,null,null,null,null,null,null,4]
[null,"Max JMF Target Value",{"$f":"_tvl2","v":100},{"$f":"_tvl3","v":100},{"$f":"_tvl4","v":100},{"$f":"_tvl5","v":90},{"$f":"_tvl6","v":70},{"$f":"_tvl7","v":42},{"$f":"_tvl8","v":42},{"$f":"_tvl9","v":29},{"$f":"_tvl10","v":10},{"$f":"_tvl11","v":10},{"$f":"_tvl12","v":2},{"$f":"_tvl13","v":2},{"$f":"_tvl14","v":2},{"$f":"IF(_tvl15=0,\"\",_tvl15)","v":""}]
[null,"Production Tolerance",{"$f":"IF(VLOOKUP(hmatype,$AB$269:$AQ$296,2,FALSE)=\"\",\"\",VLOOKUP(hmatype,$AB$269:$AQ$296,2,FALSE))","v":""},{"$f":"IF(VLOOKUP(hmatype,$AB$269:$AQ$296,3,FALSE)=\"\",\"\",VLOOKUP(hmatype,$AB$269:$AQ$296,3,FALSE))","v":""},{"$f":"IF(VLOOKUP(hmatype,$AB$269:$AQ$296,4,FALSE)=\"\",\"\",VLOOKUP(hmatype,$AB$269:$AQ$296,4,FALSE))","v":0},{"$f":"IF(VLOOKUP(hmatype,$AB$269:$AQ$296,5,FALSE)=\"\",\"\",VLOOKUP(hmatype,$AB$269:$AQ$296,5,FALSE))","v":5},{"$f":"IF(VLOOKUP(hmatype,$AB$269:$AQ$296,6,FALSE)=\"\",\"\",VLOOKUP(hmatype,$AB$269:$AQ$296,6,FALSE))","v":6},{"$f":"IF(VLOOKUP(hmatype,$AB$269:$AQ$296,7,FALSE)=\"\",\"\",VLOOKUP(hmatype,$AB$269:$AQ$296,7,FALSE))","v":"nsl / mr"},{"$f":"IF(VLOOKUP(hmatype,$AB$269:$AQ$296,8,FALSE)=\"\",\"\",VLOOKUP(hmatype,$AB$269:$AQ$296,8,FALSE))","v":5},{"$f":"IF(VLOOKUP(hmatype,$AB$269:$AQ$296,9,FALSE)=\"\",\"\",VLOOKUP(hmatype,$AB$269:$AQ$296,9,FALSE))","v":5},{"$f":"IF(VLOOKUP(hmatype,$AB$269:$AQ$296,10,FALSE)=\"\",\"\",VLOOKUP(hmatype,$AB$269:$AQ$296,10,FALSE))","v":"nsl / mr"},{"$f":"IF(VLOOKUP(hmatype,$AB$269:$AQ$296,11,FALSE)=\"\",\"\",VLOOKUP(hmatype,$AB$269:$AQ$296,11,FALSE))","v":4},{"$f":"IF(VLOOKUP(hmatype,$AB$269:$AQ$296,12,FALSE)=\"\",\"\",VLOOKUP(hmatype,$AB$269:$AQ$296,12,FALSE))","v":"nsl / mr"},{"$f":"IF(VLOOKUP(hmatype,$AB$269:$AQ$296,13,FALSE)=\"\",\"\",VLOOKUP(hmatype,$AB$269:$AQ$296,13,FALSE))","v":"nsl / mr"},{"$f":"IF(VLOOKUP(hmatype,$AB$269:$AQ$296,14,FALSE)=\"\",\"\",VLOOKUP(hmatype,$AB$269:$AQ$296,14,FALSE))","v":2},{"$f":"IF(VLOOKUP(hmatype,$AB$269:$AQ$296,15,FALSE)=\"\",\"\",VLOOKUP(hmatype,$AB$269:$AQ$296,15,FALSE))","v":0.4},null,{"$f":"VLOOKUP(hmatype,$AB$269:$AR$296,17,FALSE)","v":1.5}]
[null,"Upper Specification Limit",{"$f":"IFERROR(IF(C27=\"\",\"\",IF(C29=\"n/a\",\"n/a\",(IF(C27+C29>100,100,C27+C29)))),\"\")","v":""},"",{"$f":"IFERROR(IF(E27=\"\",\"\",IF(E29=\"n/a\",\"n/a\",(IF(E27+E29>100,100,E27+E29)))),\"\")","v":""},{"$f":"IF(F27=\"\",\"\",IF(F29=\"n/a\",\"n/a\",(IF(F27+F29>100,100,F27+F29))))","v":""},{"$f":"IF(G27=\"\",\"\",IF(G29=\"n/a\",\"n/a\",(IF(G27+G29>100,100,G27+G29))))","v":""},{"$f":"IF(H27=\"\",\"\",IF(H29=\"nsl / mr\",\"nsl / mr\",(IF(H27+H29>100,100,H27+H29))))","v":""},"","","","","","","","",{"$f":"_tvu16","v":96},{"$f":"IF(OR(R27=\"\",R27=\"n/a\"),\"\",IF(R29=\"nsl / mr\",\"nsl / mr\",(IF(R27+R29>100,100,R27+R29))))","v":5.5}]
[null,"Lower Specification Limit",{"$f":"IFERROR(IF(C27=\"\",\"\",IF(C29=\"n/a\",\"n/a\",(IF(C27-C29<0,0,C27-C29)))),\"\")","v":""},"",{"$f":"IFERROR(IF(E27=\"\",\"\",IF(E29=\"n/a\",\"n/a\",(IF(E27-E29<0,0,E27-E29)))),\"\")","v":""},{"$f":"IF(F27=\"\",\"\",IF(F29=\"n/a\",\"n/a\",(IF(F27-F29<0,0,F27-F29))))","v":""},{"$f":"IF(G27=\"\",\"\",IF(G29=\"n/a\",\"n/a\",(IF(G27-G29<0,0,G27-G29))))","v":""},{"$f":"IF(H27=\"\",\"\",IF(H29=\"nsl / mr\",\"nsl / mr\",(IF(H27-H29<0,0,H27-H29))))","v":""},{"$f":"IF(I27=\"\",\"\",IF(I29=\"nsl / mr\",\"nsl / mr\",(IF(I27-I29<0,0,I27-I29))))","v":""},"","","","","","","",{"$f":"_tvl16","v":92},{"$f":"IF(OR(R27=\"\",R27=\"n/a\"),\"\",IF(R29=\"nsl / mr\",\"nsl / mr\",(IF(R27-R29<0,0,R27-R29))))","v":2.5}]
[null,"Weighting Factor   (w)",null,null,null,null,null,null,null,{"$f":"VLOOKUP(hmatype,$AB$197:$AQ$224,9,FALSE)","v":0.05},null,null,null,null,{"$f":"VLOOKUP(hmatype,$AB$197:$AQ$224,14,FALSE)","v":0.1},{"$f":"VLOOKUP(hmatype,$AB$197:$AQ$224,15,FALSE)","v":0.25},{"$f":"VLOOKUP(hmatype,$AB$197:$AQ$224,16,FALSE)","v":0.4},{"$f":"VLOOKUP(hmatype,$AB$197:$AR$224,17,FALSE)","v":0.2}]
[]
[null,null,null,null,null,null,null,null,null,"*nsl / mr = no spec limit / must report "]
[]
[]
[]
[]
[]
[]
[]
[]
[]
[]
[]
[]
[]
[]
[]
[]
[]
[]
[]
[]
[]
[]
[]
[]
[]
[]
[]
[]
[]
[]
[]
[]
[]
[]
[]
[]
[]
[]
[]
[]
[]
[]
[]
[]
[]
[]
[]
[]
[]
[]
[]
[]
[]
[]
[]
[]
[]
[]
[]
[]
[]
[]
[]
[]
[]
[]
[]
[null,"Summary of Revisions to SPFPay Program.  (report any bugs or recommendations to     kee.foo@dot.ca.gov   -or-   pete.spector@dot.ca.gov)",null,null,null,null,null,null,null,null,null,null,null,null,null,null,null,null,null,null,null,null,null,null,null,null,null,null,null,null,null,null,null,null,null,null,null,null,null,null,null,null,null,null,null,null,null,null,null,null,null,null,"Instructions for Setting up Trusted Folders (Eliminates the need to enable Macros each time you open HMAPay)"]
[]
["Vers 1.00","Initial Release 5/20/2020 (AM)"]
["Vers 1.01","5/20/2020 (1PM) Updated to correct conditional formatting of Target Values, and a few QC Data references on the Verification Sheet.  ",null,null,null,null,null,null,null,null,null,null,null,null,null,null,null,null,null,null,null,null,null,null,null,null,null,null,null,null,null,null,null,null,null,null,null,null,null,null,null,null,null,null,null,null,null,null,null,null,null,null,"1. Click the Microsoft Office Button (top left corner), then click Excel Options."]
["Vers 1.02","6/20/2020, Added QC and Verification Averages and Standard Deviations to rows 11 and 12 on the Verificaiton Worksheet"]
[null,null,"Made modifications to the normal distribution curves to ensure plots show USL and LSL and a wider view of the curve.",null,null,null,null,null,null,null,null,null,null,null,null,null,null,null,null,null,null,null,null,null,null,null,null,null,null,null,null,null,null,null,null,null,null,null,null,null,null,null,null,null,null,null,null,null,null,null,null,null,"2. Click Trust Center, click Trust Center Settings, and then click Trusted Locations."]
[null,null,"Added an additional note on the QCData worksheet on row 76 to explain an occurance where a Beta distribution may indicate 100 percent within limits while a normal distribution may not."]
[null,null,"Updated the link in cell A5 on this worksheet to check for the latest update to this spreadsheet.",null,null,null,null,null,null,null,null,null,null,null,null,null,null,null,null,null,null,null,null,null,null,null,null,null,null,null,null,null,null,null,null,null,null,null,null,null,null,null,null,null,null,null,null,null,null,null,null,null,"3. If you want to create a trusted location that is not local to your computer, select the Allow trusted locations on my network (not recommended) check box."]
[]
[null,null,null,null,null,null,null,null,null,null,null,null,null,null,null,null,null,null,null,null,null,null,null,null,null,null,null,null,null,null,null,null,null,null,null,null,null,null,null,null,null,null,null,null,null,null,null,null,null,null,null,null,"4. Click Add new location."]
[]
[null,null,null,null,null,null,null,null,null,null,null,null,null,null,null,null,null,null,null,null,null,null,null,null,null,null,null,null,null,null,null,null,null,null,null,null,null,null,null,null,null,null,null,null,null,null,null,null,null,null,null,null,null,"It is recommended that you don't make your entire Documents or My Documents folder a trusted location.  Doing so creates"]
[null,null,null,null,null,null,null,null,null,null,null,null,null,null,null,null,null,null,null,null,null,null,null,null,null,null,null,null,null,null,null,null,null,null,null,null,null,null,null,null,null,null,null,null,null,null,null,null,null,null,null,null,null,"a larger target for a hacker to potentially exploit and increases your security risk.  Create a subfolder within Documents or My Documents, "]
[null,null,null,null,null,null,null,null,null,null,null,null,null,null,null,null,null,null,null,null,null,null,null,null,null,null,null,"  ",null,null,null,null,null,null,null,null,null,null,null,null,null,null,null,null,null,null,null,null,null,null,null,null,null,"and make only that folder a trusted location."]
[]
[null,null,null,null,null,null,null,null,null,null,null,null,null,null,null,null,null,null,null,null,null,null,null,null,null,null,null,null,null,null,null,null,null,null,null,null,null,null,null,null,null,null,null,null,null,null,null,null,null,null,null,null,"5. In the Path box, type the name of the folder that you want to use as a trusted location, or click Browse to locate the folder."]
[null,null,null,null,null,null,null,null,null,null,null,null,null,null,null,null,null,null,null,null,null,null,null,null,null,null,null,"3 Out in One Day"]
[null,null,null,null,null,null,null,null,null,null,null,null,null,null,null,null,null,null,null,null,null,null,null,null,null,null,null,null,null,null,null,null,null,null,null,null,null,null,null,null,null,null,null,null,null,null,null,null,null,null,null,null,"6. If you want to include subfolders as trusted locations, select the Subfolders of this location are also trusted check box."]
[null,null,null,null,null,null,null,null,null,null,null,null,null,null,null,null,null,null,null,null,null,null,null,null,null,null,null,"YES"]
[null,null,null,null,null,null,null,null,null,null,null,null,null,null,null,null,null,null,null,null,null,null,null,null,null,null,null,"NO",null,null,null,null,null,null,null,null,null,null,null,null,null,null,null,null,null,null,null,null,null,null,null,null,"7. In the Description box, type what you want to describe the purpose of the trusted location."]
[]
[null,null,null,null,null,null,null,null,null,null,null,null,null,null,null,null,null,null,null,null,null,null,null,null,null,null,null,null,null,null,null,null,null,null,null,null,null,null,null,null,null,null,null,null,null,null,null,null,null,null,null,null,"8. Click OK."]
[]
[]
[]
[]
[null,null,null,null,null,null,null,null,null,null,null,null,null,null,null,null,null,null,null,null,null,null,null,null,null,null,null,"Data Valadation list for to allow users to determine if the want worksheets to open up at top left corner when sheet is selected."]
[null,null,null,null,null,null,null,null,null,null,null,null,null,null,null,null,null,null,null,null,null,null,null,null,null,null,null,null,null,null,null,null,null,null,null,null,null,null,"Project Spec","Hamburg Wheel Tr.",null,null,"Lot Number Selection List"]
[null,null,null,null,null,null,null,null,null,null,null,null,null,null,null,null,null,null,null,null,null,null,null,null,null,null,null,null,null,null,null,null,null,null,null,null,null,null,"PG Binder ","0.5\" rut","at inflect"]
[null,null,null,null,null,null,null,null,null,null,null,null,null,null,null,null,null,null,null,null,null,null,null,null,null,null,null,null,null,null,null,null,null,null,null,null,null,null,"Grade",null,null,null,1]
[null,null,null,null,null,null,null,null,null,null,null,null,null,null,null,null,null,null,null,null,null,null,null,null,null,null,null,null,null,null,null,null,null,null,null,null,null,null,null,null,null,null,2]
[null,null,null,null,null,null,null,null,null,null,null,null,null,null,null,null,null,null,null,null,null,null,null,null,null,null,null,null,null,null,null,null,null,null,null,null,null,null,"PG 58-22",10000,10000,null,3]
[null,null,null,null,null,null,null,null,null,null,null,null,null,null,null,null,null,null,null,null,null,null,null,null,null,null,null,"Initial file name assembled below, DO NOT MODIFY AB133!!",null,null,null,null,null,null,null,null,null,null,"PG 64-10",15000,10000,null,4]
[null,null,null,null,null,null,null,null,null,null,null,null,null,null,null,null,null,null,null,null,null,null,null,null,null,null,null,{"$f":"\"SPFPayV1-00_\"&ea&\".xlsm\"","v":"SPFPayV1-00_.xlsm"},null,null,null,null,null,null,null,null,null,null,"PG 64-16",15000,10000,null,5]
[null,null,null,null,null,null,null,null,null,null,null,null,null,null,null,null,null,null,null,null,null,null,null,null,null,null,null,null,null,null,null,null,null,null,null,null,null,null,"PG 64-28",15000,10000,null,6]
[null,null,null,null,null,null,null,null,null,null,null,null,null,null,null,null,null,null,null,null,null,null,null,null,null,null,null,"Comment:",null,null,null,null,null,null,null,null,null,null,"PG 70-10",20000,12500,null,7]
[null,null,null,null,null,null,null,null,null,null,null,null,null,null,null,null,null,null,null,null,null,null,null,null,null,null,null,"This table provided for info only.  During design of the program, it was originally intended to be automated by the user selection.",null,null,null,null,null,null,null,null,null,null,"PG 58-34 M",10000,10000,null,8]
[null,null,null,null,null,null,null,null,null,null,null,null,null,null,null,null,null,null,null,null,null,null,null,null,null,null,null,"For rubberized HMA mixes, spec writer is supposed to specify these air void values.",null,null,null,null,null,null,null,null,null,null,"PG 64-28 M",15000,10000,null,9]
[null,null,null,null,null,null,null,null,null,null,null,null,null,null,null,null,null,null,null,null,null,null,null,null,null,null,null,"This table not used in",null,null,null,null,null,null,"Std ",null,null,null,"PG 76-22 M",25000,15000,null,10]
[null,null,null,null,null,null,null,null,null,null,null,null,null,null,null,null,null,null,null,null,null,null,null,null,null,null,null,"Traffic Index",null,"Region",null,null,null,null,"Spec"]
[null,null,null,null,null,null,null,null,null,null,null,null,null,null,null,null,null,null,null,null,null,null,null,null,null,null,null,null,"mountain ","coast","valley","desert",null,null,"dropdown"]
[null,null,null,null,null,null,null,null,null,null,null,null,null,null,null,null,null,null,null,null,null,null,null,null,null,null,null,"0 to 6",3,3,3,3]
[null,null,null,null,null,null,null,null,null,null,null,null,null,null,null,null,null,null,null,null,null,null,null,null,null,null,null,"> 6 to 10",4,4,4,5,null,null,"OBC(WDA) ..old spec"]
[null,null,null,null,null,null,null,null,null,null,null,null,null,null,null,null,null,null,null,null,null,null,null,null,null,null,null,"> 10",4,5,5,5,null,null,"OBC(TWM) ..new spec"]
[]
[]
[]
[]
[]
[null,null,null,null,null,null,null,null,null,null,null,null,null,null,null,null,null,null,null,null,null,null,null,null,null,null,null,"WHEN ADDING MIX DESIGN(S), ONLY ENTER THE MIX TYPE TEXT IN THE GRAY CELLS, ALL OTHERS MIX TYPE NAMES IN COLUMN AB REFERENCE THE GREY CELLS."]
[null,null,null,null,null,null,null,null,null,null,null,null,null,null,null,null,null,null,null,null,null,null,null,null,null,null,null,"DON’T FORGET TO INCREASE THE DATA VALIDATION LIST WHERE THE MIX TYPE IS SELECTED BY THE USER (in CELL I10)"]
[]
[null,null,null,null,null,null,null,null,null,null,null,null,null,null,null,null,null,null,null,null,null,null,null,null,null,null,null,"vlookupcolumns"]
[null,null,null,null,null,null,null,null,null,null,null,null,null,null,null,null,null,null,null,null,null,null,null,null,null,null,null,1,2,3,4,5,6,7,8,9,10,11,12,13,14,15,16]
[]
[null,null,null,null,null,null,null,null,null,null,null,null,null,null,null,null,null,null,null,null,null,null,null,null,null,null,null,"\"mixxx\" namedcell",null,null,null,null,"Percent Crushed (%min)",null,null,"LA Rattler",null,"FAA(min)","F&E(max)","VMA(min)","VFA","VFA","DP","DP"]
[null,null,null,null,null,null,null,null,null,null,null,null,null,null,null,null,null,null,null,null,null,null,null,null,null,null,null,null,"SE (min)","Stab (min)","Air Voids","%moist (max)","crs 1face","crs 2faces","#4to#8","100 rev","500rev",null,null,null,"min","max","min","max"]
[null,null,null,null,null,null,null,null,null,null,null,null,null,null,null,null,null,null,null,null,null,null,null,null,null,null,"a1",{"$f":"mixa1","v":"1\" HMA Type A"},47,null,null,1,"--",90,70,12,40,45,10,13,65,75,0.6,1.2]
[null,null,null,null,null,null,null,null,null,null,null,null,null,null,null,null,null,null,null,null,null,null,null,null,null,null,"a2",{"$f":"mixa2","v":"3/4\" HMA Type A"},47,null,null,1,"--",90,70,12,40,45,10,13,65,75,0.6,1.2]
[null,null,null,null,null,null,null,null,null,null,null,null,null,null,null,null,null,null,null,null,null,null,null,null,null,null,"b1",{"$f":"mixb1","v":"1/2\" HMA Type A"},47,null,null,1,"--",90,70,12,40,45,10,14,65,75,0.6,1.2]
[null,null,null,null,null,null,null,null,null,null,null,null,null,null,null,null,null,null,null,null,null,null,null,null,null,null,"b2",{"$f":"mixb2","v":"3/8' HMA Type A"},47,null,null,1,"--",90,70,12,40,45,10,14,65,75,0.6,1.2]
[null,null,null,null,null,null,null,null,null,null,null,null,null,null,null,null,null,null,null,null,null,null,null,null,null,null,"c1",{"$f":"mixc1","v":"No.4 HMA Type A "},47,null,null,1,"--",90,70,12,40,45,10,15,65,75,0.6,1.2]
[null,null,null,null,null,null,null,null,null,null,null,null,null,null,null,null,null,null,null,null,null,null,null,null,null,null,"c2",{"$f":"mixc2","v":0}]
[null,null,null,null,null,null,null,null,null,null,null,null,null,null,null,null,null,null,null,null,null,null,null,null,null,null,"d1",{"$f":"mixd1","v":"3/4\" RHMA-G"},47,null,null,1,"--",90,70,12,40,45,"Report Only"]
[null,null,null,null,null,null,null,null,null,null,null,null,null,null,null,null,null,null,null,null,null,null,null,null,null,null,"d2",{"$f":"mixd2","v":"1/2\" RHMA-G"},47,null,null,1,"--",90,70,12,40,45,"Report Only","18.0 - 23.0",65,75,0.6,1.2]
[null,null,null,null,null,null,null,null,null,null,null,null,null,null,null,null,null,null,null,null,null,null,null,null,null,null,"e",{"$f":"mixe","v":0}]
[null,null,null,null,null,null,null,null,null,null,null,null,null,null,null,null,null,null,null,null,null,null,null,null,null,null,"f",{"$f":"mixf","v":0}]
[null,null,null,null,null,null,null,null,null,null,null,null,null,null,null,null,null,null,null,null,null,null,null,null,null,null,"g",{"$f":"mixg","v":0}]
[null,null,null,null,null,null,null,null,null,null,null,null,null,null,null,null,null,null,null,null,null,null,null,null,null,null,"h",{"$f":"mixh","v":0}]
[null,null,null,null,null,null,null,null,null,null,null,null,null,null,null,null,null,null,null,null,null,null,null,null,null,null,"i",{"$f":"mixi","v":0}]
[null,null,null,null,null,null,null,null,null,null,null,null,null,null,null,null,null,null,null,null,null,null,null,null,null,null,"j",{"$f":"mixj","v":0}]
[null,null,null,null,null,null,null,null,null,null,null,null,null,null,null,null,null,null,null,null,null,null,null,null,null,null,"k",{"$f":"mixk","v":0}]
[null,null,null,null,null,null,null,null,null,null,null,null,null,null,null,null,null,null,null,null,null,null,null,null,null,null,"l",{"$f":"mixl","v":0}]
[null,null,null,null,null,null,null,null,null,null,null,null,null,null,null,null,null,null,null,null,null,null,null,null,null,null,"m",{"$f":"mixm","v":0}]
[null,null,null,null,null,null,null,null,null,null,null,null,null,null,null,null,null,null,null,null,null,null,null,null,null,null,"n",{"$f":"mixn","v":0}]
[null,null,null,null,null,null,null,null,null,null,null,null,null,null,null,null,null,null,null,null,null,null,null,null,null,null,"o",{"$f":"mixo","v":0}]
[null,null,null,null,null,null,null,null,null,null,null,null,null,null,null,null,null,null,null,null,null,null,null,null,null,null,"p",{"$f":"mixp","v":0}]
[null,null,null,null,null,null,null,null,null,null,null,null,null,null,null,null,null,null,null,null,null,null,null,null,null,null,"q",{"$f":"mixq","v":0}]
[null,null,null,null,null,null,null,null,null,null,null,null,null,null,null,null,null,null,null,null,null,null,null,null,null,null,"r",{"$f":"mixr","v":0}]
[null,null,null,null,null,null,null,null,null,null,null,null,null,null,null,null,null,null,null,null,null,null,null,null,null,null,"s",{"$f":"mixs","v":0}]
[null,null,null,null,null,null,null,null,null,null,null,null,null,null,null,null,null,null,null,null,null,null,null,null,null,null,"t",{"$f":"mixt","v":0}]
[null,null,null,null,null,null,null,null,null,null,null,null,null,null,null,null,null,null,null,null,null,null,null,null,null,null,"u",{"$f":"mixu","v":0}]
[null,null,null,null,null,null,null,null,null,null,null,null,null,null,null,null,null,null,null,null,null,null,null,null,null,null,"v",{"$f":"mixv","v":0}]
[null,null,null,null,null,null,null,null,null,null,null,null,null,null,null,null,null,null,null,null,null,null,null,null,null,null,"w",{"$f":"mixw","v":0}]
[null,null,null,null,null,null,null,null,null,null,null,null,null,null,null,null,null,null,null,null,null,null,null,null,null,null,"x",{"$f":"mixx","v":0}]
[null,null,null,null,null,null,null,null,null,null,null,null,null,null,null,null,null,null,null,null,null,null,null,null,null,null,null,"spec limit for "]
[]
[]
[null,null,null,null,null,null,null,null,null,null,null,null,null,null,null,null,null,null,null,null,null,null,null,null,null,null,null,null,null,null,null,null,null,null,null,"Not in the specs but need to make weighting factor add up to 1.00"]
[null,null,null,null,null,null,null,null,null,null,null,null,null,null,null,null,null,null,null,null,null,null,null,null,null,null,null,null,null,null,null,null,null,null,null,"is there a limit on this?"]
[null,null,null,null,null,null,null,null,null,null,null,null,null,null,null,null,null,null,null,null,null,null,null,null,null,null,null,null,"2\"","1-1/2\"","1\"","3/4\"","1/2\"","3/8\"","#4","#8","#16","#30","#50","#100","#200","B.C.","%MTD","Air Voids"]
[null,null,null,null,null,null,null,null,null,null,null,null,null,null,null,null,null,null,null,null,null,null,null,null,null,null,null,"vlookupcolumns"]
[null,null,null,null,null,null,null,null,null,null,null,null,null,null,null,null,null,null,null,null,null,null,null,null,null,null,null,1,2,3,4,5,6,7,8,9,10,11,12,13,14,15,16,17,18,19,20,21,22]
[null,null,null,null,null,null,null,null,null,null,null,null,null,null,null,null,null,null,null,null,null,null,null,null,null,null,null,"\"mixxx\" namedcell",null,null,null,null,null,null,null,"V1.09 changed from \"n/a\" to \"nsl / mr\"",null,null,null,"nsl / mr"]
[null,null,null,null,null,null,null,null,null,null,null,null,null,null,null,null,null,null,null,null,null,null,null,null,null,null,null,null,null,null,null,null,"Weighting Factor Table (for Rule 3 ensure cell states nsl / mr, not n/a.  N/A's set Rule 1 text on qc and qa data sheets when it should state rule 3)"]
[null,null,null,null,null,null,null,null,null,null,null,null,null,null,null,null,null,null,null,null,null,null,null,null,null,null,"a1",{"$f":"mixa1","v":"1\" HMA Type A"},0,0,0,0,0,0,0,0.05,0,0,0,0,0.1,0.25,0.4,0.2]
[null,null,null,null,null,null,null,null,null,null,null,null,null,null,null,null,null,null,null,null,null,null,null,null,null,null,"a2",{"$f":"mixa2","v":"3/4\" HMA Type A"},0,0,0,0,0,0,0,0.05,0,0,0,0,0.1,0.25,0.4,0.2]
[null,null,null,null,null,null,null,null,null,null,null,null,null,null,null,null,null,null,null,null,null,null,null,null,null,null,"b1",{"$f":"mixb1","v":"1/2\" HMA Type A"},0,0,0,0,0,0,0,0.05,0,0,0,0,0.1,0.25,0.4,0.2]
[null,null,null,null,null,null,null,null,null,null,null,null,null,null,null,null,null,null,null,null,null,null,null,null,null,null,"b2",{"$f":"mixb2","v":"3/8' HMA Type A"},0,0,0,0,0,0,0,0.05,0,0,0,0,0.1,0.25,0.4,0.2]
[null,null,null,null,null,null,null,null,null,null,null,null,null,null,null,null,null,null,null,null,null,null,null,null,null,null,"c1",{"$f":"mixc1","v":"No.4 HMA Type A "},0,0,0,0,0,0,0,0.05,0,0,0,0,0.1,0.25,0.4,0.2]
[null,null,null,null,null,null,null,null,null,null,null,null,null,null,null,null,null,null,null,null,null,null,null,null,null,null,"c2",{"$f":"mixc2","v":0}]
[null,null,null,null,null,null,null,null,null,null,null,null,null,null,null,null,null,null,null,null,null,null,null,null,null,null,"d1",{"$f":"mixd1","v":"3/4\" RHMA-G"},0,0,0,0,0,0,0,0.05,0,0,0,0,0.1,0.25,0.4,0.2]
[null,null,null,null,null,null,null,null,null,null,null,null,null,null,null,null,null,null,null,null,null,null,null,null,null,null,"d2",{"$f":"mixd2","v":"1/2\" RHMA-G"},0,0,0,0,0,0,0,0.05,0,0,0,0,0.1,0.25,0.4,0.2]
[null,null,null,null,null,null,null,null,null,null,null,null,null,null,null,null,null,null,null,null,null,null,null,null,null,null,"e",{"$f":"mixe","v":0}]
[null,null,null,null,null,null,null,null,null,null,null,null,null,null,null,null,null,null,null,null,null,null,null,null,null,null,"f",{"$f":"mixf","v":0}]
[null,null,null,null,null,null,null,null,null,null,null,null,null,null,null,null,null,null,null,null,null,null,null,null,null,null,"g",{"$f":"mixg","v":0}]
[null,null,null,null,null,null,null,null,null,null,null,null,null,null,null,null,null,null,null,null,null,null,null,null,null,null,"h",{"$f":"mixh","v":0}]
[null,null,null,null,null,null,null,null,null,null,null,null,null,null,null,null,null,null,null,null,null,null,null,null,null,null,"i",{"$f":"mixi","v":0}]
[null,null,null,null,null,null,null,null,null,null,null,null,null,null,null,null,null,null,null,null,null,null,null,null,null,null,"j",{"$f":"mixj","v":0}]
[null,null,null,null,null,null,null,null,null,null,null,null,null,null,null,null,null,null,null,null,null,null,null,null,null,null,"k",{"$f":"mixk","v":0}]
[null,null,null,null,null,null,null,null,null,null,null,null,null,null,null,null,null,null,null,null,null,null,null,null,null,null,"l",{"$f":"mixl","v":0}]
[null,null,null,null,null,null,null,null,null,null,null,null,null,null,null,null,null,null,null,null,null,null,null,null,null,null,"m",{"$f":"mixm","v":0}]
[null,null,null,null,null,null,null,null,null,null,null,null,null,null,null,null,null,null,null,null,null,null,null,null,null,null,"n",{"$f":"mixn","v":0}]
[null,null,null,null,null,null,null,null,null,null,null,null,null,null,null,null,null,null,null,null,null,null,null,null,null,null,"o",{"$f":"mixo","v":0}]
[null,null,null,null,null,null,null,null,null,null,null,null,null,null,null,null,null,null,null,null,null,null,null,null,null,null,"p",{"$f":"mixp","v":0}]
[null,null,null,null,null,null,null,null,null,null,null,null,null,null,null,null,null,null,null,null,null,null,null,null,null,null,"q",{"$f":"mixq","v":0}]
[null,null,null,null,null,null,null,null,null,null,null,null,null,null,null,null,null,null,null,null,null,null,null,null,null,null,"r",{"$f":"mixr","v":0}]
[null,null,null,null,null,null,null,null,null,null,null,null,null,null,null,null,null,null,null,null,null,null,null,null,null,null,"s",{"$f":"mixs","v":0}]
[null,null,null,null,null,null,null,null,null,null,null,null,null,null,null,null,null,null,null,null,null,null,null,null,null,null,"t",{"$f":"mixt","v":0}]
[null,null,null,null,null,null,null,null,null,null,null,null,null,null,null,null,null,null,null,null,null,null,null,null,null,null,"u",{"$f":"mixu","v":0}]
[null,null,null,null,null,null,null,null,null,null,null,null,null,null,null,null,null,null,null,null,null,null,null,null,null,null,"v",{"$f":"mixv","v":0}]
[null,null,null,null,null,null,null,null,null,null,null,null,null,null,null,null,null,null,null,null,null,null,null,null,null,null,"w",{"$f":"mixw","v":0}]
[null,null,null,null,null,null,null,null,null,null,null,null,null,null,null,null,null,null,null,null,null,null,null,null,null,null,"x",{"$f":"mixx","v":0}]
[null,null,null,null,null,null,null,null,null,null,null,null,null,null,null,null,null,null,null,null,null,null,null,null,null,null,null,{"$f":"AB261","v":"spec limit for "},null,null,"a,e","a,b,e,f","a,b,c,e,f","b,c,d,e,f","a,b,c,d,e,f","a,b,c,d,e,f",null,"a,b,c,d","g",null,"a,b,c,d,e,f"]
[]
[]
[null,null,null,null,null,null,null,null,null,null,null,null,null,null,null,null,null,null,null,null,null,null,null,null,null,null,null,"vlookupcolumns"]
[null,null,null,null,null,null,null,null,null,null,null,null,null,null,null,null,null,null,null,null,null,null,null,null,null,null,null,1,2,3,4,5,6,7,8,9,10,11,12,13,14,15,16,17]
[null,null,null,null,null,null,null,null,null,null,null,null,null,null,null,null,null,null,null,null,null,null,null,null,null,null,null,null,"2\"","1-1/2\"","1\"","3/4\"","1/2\"","3/8\"","#4","#8","#16","#30","#50","#100","#200","B.C.","%MTD","%Air Voids"]
[null,null,null,null,null,null,null,null,null,null,null,null,null,null,null,null,null,null,null,null,null,null,null,null,null,null,null,"\"mixxx\" named cells enter mix name text here only"]
[null,null,null,null,null,null,null,null,null,null,null,null,null,null,null,null,null,null,null,null,null,null,null,null,null,null,null,null,null,null,null,null,"Index (i) shown below:"]
[null,null,null,null,null,null,null,null,null,null,null,null,null,null,null,null,null,null,null,null,null,null,null,null,null,null,"a1","1\" HMA Type A",null,null,null,null,null,null,null,1,null,null,null,null,2,3,5,4]
[null,null,null,null,null,null,null,null,null,null,null,null,null,null,null,null,null,null,null,null,null,null,null,null,null,null,"a2","3/4\" HMA Type A",null,null,null,null,null,null,null,1,null,null,null,null,2,3,5,4]
[null,null,null,null,null,null,null,null,null,null,null,null,null,null,null,null,null,null,null,null,null,null,null,null,null,null,"b1","1/2\" HMA Type A",null,null,null,null,null,null,null,1,null,null,null,null,2,3,5,4]
[null,null,null,null,null,null,null,null,null,null,null,null,null,null,null,null,null,null,null,null,null,null,null,null,null,null,"b2","3/8' HMA Type A",null,null,null,null,null,null,null,1,null,null,null,null,2,3,5,4]
[null,null,null,null,null,null,null,null,null,null,null,null,null,null,null,null,null,null,null,null,null,null,null,null,null,null,"c1","No.4 HMA Type A ",null,null,null,null,null,null,null,1,null,null,null,null,2,3,5,4]
[null,null,null,null,null,null,null,null,null,null,null,null,null,null,null,null,null,null,null,null,null,null,null,null,null,null,"c2"]
[null,null,null,null,null,null,null,null,null,null,null,null,null,null,null,null,null,null,null,null,null,null,null,null,null,null,"d1","3/4\" RHMA-G",null,null,null,null,null,null,null,1,null,null,null,null,2,3,5,4]
[null,null,null,null,null,null,null,null,null,null,null,null,null,null,null,null,null,null,null,null,null,null,null,null,null,null,"d2","1/2\" RHMA-G",null,null,null,null,null,null,null,1,null,null,null,null,2,3,5,4]
[null,null,null,null,null,null,null,null,null,null,null,null,null,null,null,null,null,null,null,null,null,null,null,null,null,null,"e"]
[null,null,null,null,null,null,null,null,null,null,null,null,null,null,null,null,null,null,null,null,null,null,null,null,null,null,"f"]
[null,null,null,null,null,null,null,null,null,null,null,null,null,null,null,null,null,null,null,null,null,null,null,null,null,null,"g"]
[null,null,null,null,null,null,null,null,null,null,null,null,null,null,null,null,null,null,null,null,null,null,null,null,null,null,"h"]
[null,null,null,null,null,null,null,null,null,null,null,null,null,null,null,null,null,null,null,null,null,null,null,null,null,null,"i"]
[null,null,null,null,null,null,null,null,null,null,null,null,null,null,null,null,null,null,null,null,null,null,null,null,null,null,"j"]
[null,null,null,null,null,null,null,null,null,null,null,null,null,null,null,null,null,null,null,null,null,null,null,null,null,null,"k"]
[null,null,null,null,null,null,null,null,null,null,null,null,null,null,null,null,null,null,null,null,null,null,null,null,null,null,"l"]
[null,null,null,null,null,null,null,null,null,null,null,null,null,null,null,null,null,null,null,null,null,null,null,null,null,null,"m"]
[null,null,null,null,null,null,null,null,null,null,null,null,null,null,null,null,null,null,null,null,null,null,null,null,null,null,"n"]
[null,null,null,null,null,null,null,null,null,null,null,null,null,null,null,null,null,null,null,null,null,null,null,null,null,null,"o"]
[null,null,null,null,null,null,null,null,null,null,null,null,null,null,null,null,null,null,null,null,null,null,null,null,null,null,"p"]
[null,null,null,null,null,null,null,null,null,null,null,null,null,null,null,null,null,null,null,null,null,null,null,null,null,null,"q"]
[null,null,null,null,null,null,null,null,null,null,null,null,null,null,null,null,null,null,null,null,null,null,null,null,null,null,"r"]
[null,null,null,null,null,null,null,null,null,null,null,null,null,null,null,null,null,null,null,null,null,null,null,null,null,null,"s"]
[null,null,null,null,null,null,null,null,null,null,null,null,null,null,null,null,null,null,null,null,null,null,null,null,null,null,"t"]
[null,null,null,null,null,null,null,null,null,null,null,null,null,null,null,null,null,null,null,null,null,null,null,null,null,null,"u"]
[null,null,null,null,null,null,null,null,null,null,null,null,null,null,null,null,null,null,null,null,null,null,null,null,null,null,"v"]
[null,null,null,null,null,null,null,null,null,null,null,null,null,null,null,null,null,null,null,null,null,null,null,null,null,null,"w"]
[null,null,null,null,null,null,null,null,null,null,null,null,null,null,null,null,null,null,null,null,null,null,null,null,null,null,"x"]
[null,null,null,null,null,null,null,null,null,null,null,null,null,null,null,null,null,null,null,null,null,null,null,null,null,null,null,"spec limit for ",null,null,"a,e","a,b,e,f","a,b,c,e,f","b,c,d,e,f","a,b,c,d,e,f","a,b,c,d,e,f",null,"a,b,c,d","g",null,"a,b,c,d,e,f"]
[]
[null,null,null,null,null,null,null,null,null,null,null,null,null,null,null,null,null,null,null,null,null,null,null,null,null,null,null,null,"2\"","1-1/2\"","1\"","3/4\"","1/2\"","3/8\"","#4","#8","#16","#30","#50","#100","#200","B.C.","%MTD","%Air Voids"]
[null,null,null,null,null,null,null,null,null,null,null,null,null,null,null,null,null,null,null,null,null,null,null,null,null,null,null,null,null,null,null,null,null,null,null,null,null,null,null,null,null,null,null,null,null,null,null,"col for info only.Used for AX287toAX289"]
[null,null,null,null,null,null,null,null,null,null,null,null,null,null,null,null,null,null,null,null,null,null,null,null,null,null,null,null,"2\"","1-1/2\"","1\"","3/4\"","1/2\"","3/8\"","#4","#8","#16","#30","#50","#100","#200","B.C.","%MTD","%Air Voids"]
[null,null,null,null,null,null,null,null,null,null,null,null,null,null,null,null,null,null,null,null,null,null,null,null,null,null,null,"vlookupcolumns",null,null,"changed n/a to 0",null,null,null,null,null,null,null,null,null,null,null,null,"air voids +",null,null,null,null,"Lower MTD","Upper MTD"]
[null,null,null,null,null,null,null,null,null,null,null,null,null,null,null,null,null,null,null,null,null,null,null,null,null,null,null,1,2,3,4,5,6,7,8,9,10,11,12,13,14,15,16,17,18,19,null,21,22,23,24,25,26]
[null,null,null,null,null,null,null,null,null,null,null,null,null,null,null,null,null,null,null,null,null,null,null,null,null,null,"mixdesx",null,null,null,null,null,"+ or -  % Allowable Tolerances shown below (if 0, then only applys to usl)",null,null,null,null,null,null,null,null,null,null,null,null,"mixdesx - hmatype "]
[null,null,null,null,null,null,null,null,null,null,null,null,null,null,null,null,null,null,null,null,null,null,null,null,null,null,"a1",{"$f":"mixa1","v":"1\" HMA Type A"},null,null,0,5,6,6,7,5,"nsl / mr",4,4,"nsl / mr",2,0.4,null,1.5,null,{"$f":"\"mix\"&AA269&\"  - \"&AB269","v":"mixa1  - 1\" HMA Type A"},null,0.04,92,96]
[null,null,null,null,null,null,null,null,null,null,null,null,null,null,null,null,null,null,null,null,null,null,null,null,null,null,"a2",{"$f":"mixa2","v":"3/4\" HMA Type A"},null,null,0,5,6,"nsl / mr",5,5,"nsl / mr",4,"nsl / mr","nsl / mr",2,0.4,null,1.5,null,{"$f":"\"mix\"&AA270&\"  - \"&AB270","v":"mixa2  - 3/4\" HMA Type A"},null,0.04,92,96]
[null,null,null,null,null,null,null,null,null,null,null,null,null,null,null,null,null,null,null,null,null,null,null,null,null,null,"b1",{"$f":"mixb1","v":"1/2\" HMA Type A"},null,null,null,0,5,5,5,5,"nsl / mr",4,"nsl / mr","nsl / mr",2,0.4,null,1.5,null,"mixb1  - 1/2\" HMA Type A",null,0.04,92,96]
[null,null,null,null,null,null,null,null,null,null,null,null,null,null,null,null,null,null,null,null,null,null,null,null,null,null,"b2",{"$f":"mixb2","v":"3/8' HMA Type A"},null,null,null,null,0,5,5,5,"nsl / mr",5,"nsl / mr","nsl / mr",2,0.4,null,1.5,null,"mixb2  - 3/8' HMA Type A",null,0.04,92,96]
[null,null,null,null,null,null,null,null,null,null,null,null,null,null,null,null,null,null,null,null,null,null,null,null,null,null,"c1",{"$f":"mixc1","v":"No.4 HMA Type A "},null,null,null,null,null,0,5,6,"nsl / mr",5,"nsl / mr","nsl / mr",4,0.4,null,1.5,null,"mixc1  - No.4 HMA Type A ",null,0.04,92,96]
[null,null,null,null,null,null,null,null,null,null,null,null,null,null,null,null,null,null,null,null,null,null,null,null,null,null,"c2",{"$f":"mixc2","v":0},null,null,null,null,null,null,null,null,null,null,null,null,null,null,null,null,null,"mixc2  - 0",null,0.04]
[null,null,null,null,null,null,null,null,null,null,null,null,null,null,null,null,null,null,null,null,null,null,null,null,null,null,"d1",{"$f":"mixd1","v":"3/4\" RHMA-G"},null,null,0,5,6,5,6,5,"nsl / mr","nsl / mr","nsl / mr","nsl / mr",2,0.45,null,2,null,"mixd1  - 3/4\" RHMA-G",null,0.04,91,96]
[null,null,null,null,null,null,null,null,null,null,null,null,null,null,null,null,null,null,null,null,null,null,null,null,null,null,"d2",{"$f":"mixd2","v":"1/2\" RHMA-G"},null,null,null,0,6,5,6,5,"nsl / mr","nsl / mr","nsl / mr","nsl / mr",2,0.45,null,2,null,"mixd2  - 1/2\" RHMA-G",null,0.04,91,96]
[null,null,null,null,null,null,null,null,null,null,null,null,null,null,null,null,null,null,null,null,null,null,null,null,null,null,"e",{"$f":"mixe","v":0},null,null,null,null,null,null,null,null,null,null,null,null,null,null,null,null,null,"mixe  - 0",null,"\"3,4, or 5%"]
[null,null,null,null,null,null,null,null,null,null,null,null,null,null,null,null,null,null,null,null,null,null,null,null,null,null,"f",{"$f":"mixf","v":0},null,null,null,null,null,null,null,null,null,null,null,null,null,null,null,null,null,"mixf  - 0",null,"\"3,4, or 5%"]
[null,null,null,null,null,null,null,null,null,null,null,null,null,null,null,null,null,null,null,null,null,null,null,null,null,null,"g",{"$f":"mixg","v":0},null,null,null,null,null,null,null,null,null,null,null,null,null,null,null,null,null,"mixg  - 0",null,0.05]
[null,null,null,null,null,null,null,null,null,null,null,null,null,null,null,null,null,null,null,null,null,null,null,null,null,null,"h",{"$f":"mixh","v":0},null,null,null,null,null,null,null,null,null,null,null,null,null,null,null,null,null,"mixh  - 0",null,0.04]
[null,null,null,null,null,null,null,null,null,null,null,null,null,null,null,null,null,null,null,null,null,null,null,null,null,null,"i",{"$f":"mixi","v":0},null,null,null,null,null,null,null,null,null,null,null,null,null,null,null,null,null,"mixi  - 0",null,0.05]
[null,null,null,null,null,null,null,null,null,null,null,null,null,null,null,null,null,null,null,null,null,null,null,null,null,null,"j",{"$f":"mixj","v":0},null,null,null,null,null,null,null,null,null,null,null,null,null,null,null,null,null,"mixj  - 0",null,0.04]
[null,null,null,null,null,null,null,null,null,null,null,null,null,null,null,null,null,null,null,null,null,null,null,null,null,null,"k",{"$f":"mixk","v":0},null,null,null,null,null,null,null,null,null,null,null,null,null,null,null,null,null,"mixk  - 0",null,0.05]
[null,null,null,null,null,null,null,null,null,null,null,null,null,null,null,null,null,null,null,null,null,null,null,null,null,null,"l",{"$f":"mixl","v":0},null,null,null,null,null,null,null,null,null,null,null,null,null,null,null,null,null,"mixl  - 0",null,0.04]
[null,null,null,null,null,null,null,null,null,null,null,null,null,null,null,null,null,null,null,null,null,null,null,null,null,null,"m",{"$f":"mixm","v":0},null,null,null,null,null,null,null,null,null,null,null,null,null,null,null,null,null,"mixm  - 0",null,"n/a"]
[null,null,null,null,null,null,null,null,null,null,null,null,null,null,null,null,null,null,null,null,null,null,null,null,null,null,"n",{"$f":"mixn","v":0},null,null,null,null,null,null,null,null,null,null,null,null,null,null,null,null,null,"mixn  - 0",null,"n/a"]
[null,null,null,null,null,null,null,null,null,null,null,null,null,null,null,null,null,null,null,null,null,null,null,null,null,null,"o",{"$f":"mixo","v":0},null,null,null,null,null,null,null,null,null,null,null,null,null,null,null,null,null,"mixo  - 0",null,"\"3,4, or 5%","Data Validation for air voids entry"]
[null,null,null,null,null,null,null,null,null,null,null,null,null,null,null,null,null,null,null,null,null,null,null,null,null,null,"p",{"$f":"mixp","v":0},null,null,null,null,null,null,null,null,null,null,null,null,null,null,null,null,null,"mixp  - 0",null,null,"After selecting a mix type, the range below will yield indicating which air voids are possible"]
[null,null,null,null,null,null,null,null,null,null,null,null,null,null,null,null,null,null,null,null,null,null,null,null,null,null,"q",{"$f":"mixq","v":0},null,null,null,null,null,null,null,null,null,null,null,null,null,null,null,null,null,"mixq  - 0",null,null,"\"4%",{"$f":"IF(OR(hmatype=mixa1,hmatype=mixa2, hmatype=mixb1,hmatype=mixb2,\nhmatype=mixc1,hmatype=mixc2,hmatype=mixd1,hmatype=mixd2,hmatype=mixh,hmatype=mixj,hmatype=mixl,hmatype=mixt,hmatype=mixv,hmatype=mixw,hmatype=mixx),\n1,0)","v":1},"<=add to equation when hmatypes are added (if necessary)"]
[null,null,null,null,null,null,null,null,null,null,null,null,null,null,null,null,null,null,null,null,null,null,null,null,null,null,"r",{"$f":"mixr","v":0},null,null,null,null,null,null,null,null,null,null,null,null,null,null,null,null,null,"mixr  - 0",null,null,"\"5%",{"$f":"IF(OR(hmatype=mixg,hmatype=mixi,hmatype=mixk),1,0)","v":0},"<=add to equation when hmatypes are added (if necessary)"]
[null,null,null,null,null,null,null,null,null,null,null,null,null,null,null,null,null,null,null,null,null,null,null,null,null,null,"s",{"$f":"mixs","v":0},null,null,null,null,null,null,null,null,null,null,null,null,null,null,null,null,null,"mixs  - 0",null,null,"\"3,4, or 5%",{"$f":"IF(OR(hmatype=mixe,hmatype=mixf,hmatype=mixs,hmatype=mixo),1,0)","v":0},"<=add to equation when hmatypes are added (if necessary)"]
[null,null,null,null,null,null,null,null,null,null,null,null,null,null,null,null,null,null,null,null,null,null,null,null,null,null,"t",{"$f":"mixt","v":0},null,null,null,null,null,null,null,null,null,null,null,null,null,null,null,null,null,"mixt  - 0",null,0.04,"\"n/a\"",{"$f":"IF(OR(hmatype=mixm,hmatype=mixn),1,0)","v":0},"<=add to equation when hmatypes are added (if necessary)"]
[null,null,null,null,null,null,null,null,null,null,null,null,null,null,null,null,null,null,null,null,null,null,null,null,null,null,"u",{"$f":"mixu","v":0},null,null,null,null,null,null,null,null,null,null,null,null,null,null,null,null,null,"mixu  - 0"]
[null,null,null,null,null,null,null,null,null,null,null,null,null,null,null,null,null,null,null,null,null,null,null,null,null,null,"v",{"$f":"mixv","v":0},null,null,null,null,null,null,null,null,null,null,null,null,null,null,null,null,null,"mixv  - 0"]
[null,null,null,null,null,null,null,null,null,null,null,null,null,null,null,null,null,null,null,null,null,null,null,null,null,null,"w",{"$f":"mixw","v":0},null,null,null,null,null,null,null,null,null,null,null,null,null,null,null,null,null,"mixw  - 0"]
[null,null,null,null,null,null,null,null,null,null,null,null,null,null,null,null,null,null,null,null,null,null,null,null,null,null,"x",{"$f":"mixx","v":0},null,null,null,null,null,null,null,null,null,null,null,null,null,null,null,null,null,"mixx  - 0"]
[]
[null,null,null,null,null,null,null,null,null,null,null,null,null,null,null,null,null,null,null,null,null,null,null,null,null,null,null,"vlookupcolumns"]
[null,null,null,null,null,null,null,null,null,null,null,null,null,null,null,null,null,null,null,null,null,null,null,null,null,null,null,1,2,3,4,5,6,7,8,9,10,11,12,13,14,15,16,17]
[null,null,null,null,null,null,null,null,null,null,null,null,null,null,null,null,null,null,null,null,null,null,null,null,null,null,null,"Upper end limit=>",{"$f":"VLOOKUP(hmatype,$AB$305:$AQ$332,2,FALSE)","v":100},{"$f":"VLOOKUP(hmatype,$AB$305:$AQ$332,3,FALSE)","v":100},{"$f":"VLOOKUP(hmatype,$AB$305:$AQ$332,4,FALSE)","v":100},{"$f":"VLOOKUP(hmatype,$AB$305:$AQ$332,5,FALSE)","v":98},{"$f":"VLOOKUP(hmatype,$AB$305:$AQ$332,6,FALSE)","v":90},{"$f":"VLOOKUP(hmatype,$AB$305:$AQ$332,7,FALSE)","v":90},{"$f":"VLOOKUP(hmatype,$AB$305:$AQ$332,8,FALSE)","v":58},{"$f":"VLOOKUP(hmatype,$AB$305:$AQ$332,9,FALSE)","v":43},{"$f":"VLOOKUP(hmatype,$AB$305:$AQ$332,10,FALSE)","v":43},{"$f":"VLOOKUP(hmatype,$AB$305:$AQ$332,11,FALSE)","v":23},{"$f":"VLOOKUP(hmatype,$AB$305:$AQ$332,12,FALSE)","v":23},{"$f":"VLOOKUP(hmatype,$AB$305:$AQ$332,13,FALSE)","v":23},{"$f":"VLOOKUP(hmatype,$AB$305:$AQ$332,14,FALSE)","v":7},{"$f":"VLOOKUP(hmatype,$AB$305:$AQ$332,15,FALSE)","v":100},{"$f":"IF(VLOOKUP(hmatype,$AB$269:$AX$296,23,FALSE)=\"\",\"\",VLOOKUP(hmatype,$AB$269:$AX$296,23,FALSE))","v":96}]
[null,null,null,null,null,null,null,null,null,null,null,null,null,null,null,null,null,null,null,null,null,null,null,null,null,null,null,"Lower end limit=>",{"$f":"VLOOKUP(hmatype,$AB$337:$AQ$364,2,FALSE)","v":100},{"$f":"VLOOKUP(hmatype,$AB$337:$AQ$364,3,FALSE)","v":100},{"$f":"VLOOKUP(hmatype,$AB$337:$AQ$364,4,FALSE)","v":100},{"$f":"VLOOKUP(hmatype,$AB$337:$AQ$364,5,FALSE)","v":90},{"$f":"VLOOKUP(hmatype,$AB$337:$AQ$364,6,FALSE)","v":70},{"$f":"VLOOKUP(hmatype,$AB$337:$AQ$364,7,FALSE)","v":42},{"$f":"VLOOKUP(hmatype,$AB$337:$AQ$364,8,FALSE)","v":42},{"$f":"VLOOKUP(hmatype,$AB$337:$AQ$364,9,FALSE)","v":29},{"$f":"VLOOKUP(hmatype,$AB$337:$AQ$364,10,FALSE)","v":10},{"$f":"VLOOKUP(hmatype,$AB$337:$AQ$364,11,FALSE)","v":10},{"$f":"VLOOKUP(hmatype,$AB$337:$AQ$364,12,FALSE)","v":2},{"$f":"VLOOKUP(hmatype,$AB$337:$AQ$364,13,FALSE)","v":2},{"$f":"VLOOKUP(hmatype,$AB$337:$AQ$364,14,FALSE)","v":2},{"$f":"VLOOKUP(hmatype,$AB$337:$AQ$364,15,FALSE)","v":0},{"$f":"IF(VLOOKUP(hmatype,$AB$269:$AX$296,22,FALSE)=\"\",\"\",VLOOKUP(hmatype,$AB$269:$AX$296,22,FALSE))","v":92}]
[null,null,null,null,null,null,null,null,null,null,null,null,null,null,null,null,null,null,null,null,null,null,null,null,null,null,null,null,"2\"","1-1/2\"","1\"","3/4\"","1/2\"","3/8\"","#4","#8","#16","#30","#50","#100","#200","B.C.","%MTD","%Air Voids","SE",null,"(Also don't forget to modify the three \"charts\" cells BA3 and BA4 to make the red lines and markers plot according to the text pulled from AQ267 to AQ194"]
[null,null,null,null,null,null,null,null,null,null,null,null,null,null,null,null,null,null,null,null,null,null,null,null,null,null,null,null,"Target values upper end limit"]
[null,null,null,null,null,null,null,null,null,null,null,null,null,null,null,null,null,null,null,null,null,null,null,null,null,null,"mixdesx",null,null,null,null,null,null,"Red values have no listed requirement but rely on next larger sieve with a spec value shown in black"]
[null,null,null,null,null,null,null,null,null,null,null,null,null,null,null,null,null,null,null,null,null,null,null,null,null,null,"a1",{"$f":"mixa1","v":"1\" HMA Type A"},100,100,100,93,85,70,52,40,24,24,18,18,7,100,null,4]
[null,null,null,null,null,null,null,null,null,null,null,null,null,null,null,null,null,null,null,null,null,null,null,null,null,null,"a2",{"$f":"mixa2","v":"3/4\" HMA Type A"},100,100,100,98,90,90,58,43,43,23,23,23,7,100,null,4]
[null,null,null,null,null,null,null,null,null,null,null,null,null,null,null,null,null,null,null,null,null,null,null,null,null,null,"b1",{"$f":"mixb1","v":"1/2\" HMA Type A"},null,null,null,100,98,95,69,55,55,30,30,30,8,100,null,4]
[null,null,null,null,null,null,null,null,null,null,null,null,null,null,null,null,null,null,null,null,null,null,null,null,null,null,"b2",{"$f":"mixb2","v":"3/8' HMA Type A"},null,null,null,null,100,98,75,50,50,35,35,35,9,100,null,4]
[null,null,null,null,null,null,null,null,null,null,null,null,null,null,null,null,null,null,null,null,null,null,null,null,null,null,"c1",{"$f":"mixc1","v":"No.4 HMA Type A "},null,null,null,null,null,100,98,80,80,45,45,45,12,100,null,4]
[null,null,null,null,null,null,null,null,null,null,null,null,null,null,null,null,null,null,null,null,null,null,null,null,null,null,"c2",{"$f":"mixc2","v":0}]
[null,null,null,null,null,null,null,null,null,null,null,null,null,null,null,null,null,null,null,null,null,null,null,null,null,null,"d1",{"$f":"mixd1","v":"3/4\" RHMA-G"},100,100,100,98,87,70,42,22,22,22,22,22,6,100,null,4]
[null,null,null,null,null,null,null,null,null,null,null,null,null,null,null,null,null,null,null,null,null,null,null,null,null,null,"d2",{"$f":"mixd2","v":"1/2\" RHMA-G"},100,100,100,100,98,87,42,22,22,22,22,22,6,100,null,4]
[null,null,null,null,null,null,null,null,null,null,null,null,null,null,null,null,null,null,null,null,null,null,null,null,null,null,"e",{"$f":"mixe","v":0}]
[null,null,null,null,null,null,null,null,null,null,null,null,null,null,null,null,null,null,null,null,null,null,null,null,null,null,"f",{"$f":"mixf","v":0}]
[null,null,null,null,null,null,null,null,null,null,null,null,null,null,null,null,null,null,null,null,null,null,null,null,null,null,"g",{"$f":"mixg","v":0}]
[null,null,null,null,null,null,null,null,null,null,null,null,null,null,null,null,null,null,null,null,null,null,null,null,null,null,"h",{"$f":"mixh","v":0}]
[null,null,null,null,null,null,null,null,null,null,null,null,null,null,null,null,null,null,null,null,null,null,null,null,null,null,"i",{"$f":"mixi","v":0}]
[null,null,null,null,null,null,null,null,null,null,null,null,null,null,null,null,null,null,null,null,null,null,null,null,null,null,"j",{"$f":"mixj","v":0}]
[null,null,null,null,null,null,null,null,null,null,null,null,null,null,null,null,null,null,null,null,null,null,null,null,null,null,"k",{"$f":"mixk","v":0}]
[null,null,null,null,null,null,null,null,null,null,null,null,null,null,null,null,null,null,null,null,null,null,null,null,null,null,"l",{"$f":"mixl","v":0}]
[null,null,null,null,null,null,null,null,null,null,null,null,null,null,null,null,null,null,null,null,null,null,null,null,null,null,"m",{"$f":"mixm","v":0}]
[null,null,null,null,null,null,null,null,null,null,null,null,null,null,null,null,null,null,null,null,null,null,null,null,null,null,"n",{"$f":"mixn","v":0}]
[null,null,null,null,null,null,null,null,null,null,null,null,null,null,null,null,null,null,null,null,null,null,null,null,null,null,"o",{"$f":"mixo","v":0}]
[null,null,null,null,null,null,null,null,null,null,null,null,null,null,null,null,null,null,null,null,null,null,null,null,null,null,"p",{"$f":"mixp","v":0}]
[null,null,null,null,null,null,null,null,null,null,null,null,null,null,null,null,null,null,null,null,null,null,null,null,null,null,"q",{"$f":"mixq","v":0}]
[null,null,null,null,null,null,null,null,null,null,null,null,null,null,null,null,null,null,null,null,null,null,null,null,null,null,"r",{"$f":"mixr","v":0}]
[null,null,null,null,null,null,null,null,null,null,null,null,null,null,null,null,null,null,null,null,null,null,null,null,null,null,"s",{"$f":"mixs","v":0}]
[null,null,null,null,null,null,null,null,null,null,null,null,null,null,null,null,null,null,null,null,null,null,null,null,null,null,"t",{"$f":"mixt","v":0}]
[null,null,null,null,null,null,null,null,null,null,null,null,null,null,null,null,null,null,null,null,null,null,null,null,null,null,"u",{"$f":"mixu","v":0}]
[null,null,null,null,null,null,null,null,null,null,null,null,null,null,null,null,null,null,null,null,null,null,null,null,null,null,"v",{"$f":"mixv","v":0}]
[null,null,null,null,null,null,null,null,null,null,null,null,null,null,null,null,null,null,null,null,null,null,null,null,null,null,"w",{"$f":"mixw","v":0}]
[null,null,null,null,null,null,null,null,null,null,null,null,null,null,null,null,null,null,null,null,null,null,null,null,null,null,"x",{"$f":"mixx","v":0}]
[null,null,null,null,null,null,null,null,null,null,null,null,null,null,null,null,null,null,null,null,null,null,null,null,null,null,null,"vlookupcolumns"]
[null,null,null,null,null,null,null,null,null,null,null,null,null,null,null,null,null,null,null,null,null,null,null,null,null,null,null,1,2,3,4,5,6,7,8,9,10,11,12,13,14,15,16,17]
[null,null,null,null,null,null,null,null,null,null,null,null,null,null,null,null,null,null,null,null,null,null,null,null,null,null,null,null,"2\"","1-1/2\"","1\"","3/4\"","1/2\"","3/8\"","#4","#8","#16","#30","#50","#100","#200","B.C.","%MTD","%Air Voids","SE"]
[null,null,null,null,null,null,null,null,null,null,null,null,null,null,null,null,null,null,null,null,null,null,null,null,null,null,"mixdesx",null,"Target values lower limit",null,null,null,null,"Red values have no listed requirement but rely on next smaller sieve with a spec value shown in black"]
[null,null,null,null,null,null,null,null,null,null,null,null,null,null,null,null,null,null,null,null,null,null,null,null,null,null,"a1",{"$f":"mixa1","v":"1\" HMA Type A"},100,100,100,88,72,55,35,22,8,8,5,3,3,0]
[null,null,null,null,null,null,null,null,null,null,null,null,null,null,null,null,null,null,null,null,null,null,null,null,null,null,"a2",{"$f":"mixa2","v":"3/4\" HMA Type A"},100,100,100,90,70,42,42,29,10,10,2,2,2,0]
[null,null,null,null,null,null,null,null,null,null,null,null,null,null,null,null,null,null,null,null,null,null,null,null,null,null,"b1",{"$f":"mixb1","v":"1/2\" HMA Type A"},null,null,null,100,95,72,52,35,15,15,2,2,2,0]
[null,null,null,null,null,null,null,null,null,null,null,null,null,null,null,null,null,null,null,null,null,null,null,null,null,null,"b2",{"$f":"mixb2","v":"3/8' HMA Type A"},null,null,null,null,100,95,55,30,15,15,2,2,2,0]
[null,null,null,null,null,null,null,null,null,null,null,null,null,null,null,null,null,null,null,null,null,null,null,null,null,null,"c1",{"$f":"mixc1","v":"No.4 HMA Type A "},null,null,null,null,null,100,95,70,34,34,2,2,2,0]
[null,null,null,null,null,null,null,null,null,null,null,null,null,null,null,null,null,null,null,null,null,null,null,null,null,null,"c2",{"$f":"mixc2","v":0}]
[null,null,null,null,null,null,null,null,null,null,null,null,null,null,null,null,null,null,null,null,null,null,null,null,null,null,"d1",{"$f":"mixd1","v":"3/4\" RHMA-G"},100,100,100,95,83,65,28,14,0,0,0,0,0,7.5]
[null,null,null,null,null,null,null,null,null,null,null,null,null,null,null,null,null,null,null,null,null,null,null,null,null,null,"d2",{"$f":"mixd2","v":"1/2\" RHMA-G"},100,100,100,100,90,83,28,14,0,0,0,0,0,7.5]
[null,null,null,null,null,null,null,null,null,null,null,null,null,null,null,null,null,null,null,null,null,null,null,null,null,null,"e",{"$f":"mixe","v":0}]
[null,null,null,null,null,null,null,null,null,null,null,null,null,null,null,null,null,null,null,null,null,null,null,null,null,null,"f",{"$f":"mixf","v":0}]
[null,null,null,null,null,null,null,null,null,null,null,null,null,null,null,null,null,null,null,null,null,null,null,null,null,null,"g",{"$f":"mixg","v":0}]
[null,null,null,null,null,null,null,null,null,null,null,null,null,null,null,null,null,null,null,null,null,null,null,null,null,null,"h",{"$f":"mixh","v":0}]
[null,null,null,null,null,null,null,null,null,null,null,null,null,null,null,null,null,null,null,null,null,null,null,null,null,null,"i",{"$f":"mixi","v":0}]
[null,null,null,null,null,null,null,null,null,null,null,null,null,null,null,null,null,null,null,null,null,null,null,null,null,null,"j",{"$f":"mixj","v":0}]
[null,null,null,null,null,null,null,null,null,null,null,null,null,null,null,null,null,null,null,null,null,null,null,null,null,null,"k",{"$f":"mixk","v":0}]
[null,null,null,null,null,null,null,null,null,null,null,null,null,null,null,null,null,null,null,null,null,null,null,null,null,null,"l",{"$f":"mixl","v":0}]
[null,null,null,null,null,null,null,null,null,null,null,null,null,null,null,null,null,null,null,null,null,null,null,null,null,null,"m",{"$f":"mixm","v":0}]
[null,null,null,null,null,null,null,null,null,null,null,null,null,null,null,null,null,null,null,null,null,null,null,null,null,null,"n",{"$f":"mixn","v":0}]
[null,null,null,null,null,null,null,null,null,null,null,null,null,null,null,null,null,null,null,null,null,null,null,null,null,null,"o",{"$f":"mixo","v":0}]
[null,null,null,null,null,null,null,null,null,null,null,null,null,null,null,null,null,null,null,null,null,null,null,null,null,null,"p",{"$f":"mixp","v":0}]
[null,null,null,null,null,null,null,null,null,null,null,null,null,null,null,null,null,null,null,null,null,null,null,null,null,null,"q",{"$f":"mixq","v":0}]
[null,null,null,null,null,null,null,null,null,null,null,null,null,null,null,null,null,null,null,null,null,null,null,null,null,null,"r",{"$f":"mixr","v":0}]
[null,null,null,null,null,null,null,null,null,null,null,null,null,null,null,null,null,null,null,null,null,null,null,null,null,null,"s",{"$f":"mixs","v":0}]
[null,null,null,null,null,null,null,null,null,null,null,null,null,null,null,null,null,null,null,null,null,null,null,null,null,null,"t",{"$f":"mixt","v":0}]
[null,null,null,null,null,null,null,null,null,null,null,null,null,null,null,null,null,null,null,null,null,null,null,null,null,null,"u",{"$f":"mixu","v":0}]
[null,null,null,null,null,null,null,null,null,null,null,null,null,null,null,null,null,null,null,null,null,null,null,null,null,null,"v",{"$f":"mixv","v":0}]
[null,null,null,null,null,null,null,null,null,null,null,null,null,null,null,null,null,null,null,null,null,null,null,null,null,null,"w",{"$f":"mixw","v":0}]
[null,null,null,null,null,null,null,null,null,null,null,null,null,null,null,null,null,null,null,null,null,null,null,null,null,null,"x",{"$f":"mixx","v":0}]
[null,null,null,null,null,null,null,null,null,null,null,null,null,null,null,null,null,null,null,null,null,null,null,null,null,null,null,"vlookupcolumns"]
[null,null,null,null,null,null,null,null,null,null,null,null,null,null,null,null,null,null,null,null,null,null,null,null,null,null,null,1,2,3,4,5,6,7,8,9,10,11,12,13,14,15,16,17]
[]
[null,null,null,null,null,null,null,null,null,null,null,null,null,null,null,null,null,null,null,null,null,null,null,null,null,null,null,null,null,null,null,null,"no spec limit, must report"]

{"sheet":"QCData","index":1,"n_rows":300,"n_cols":97,"rows_kept":300,"cut":false,"hidden":false,"merged":[]}
["QCData Worksheet"]
[null,null,null,null,null,null,null,null,null,null,null,null,null,null,"EA(or Project ID):",{"$f":"IF(ea=\"\",\"\",dist_ea)","v":""},null,null,null,null,null,null,"© 2020 California Department of Transportation"]
[null,null,null,null,null,null,null,null,null,null,null,null,null,null,"Resident Engineer:",{"$f":"IF(resengrname=\"\",\"\",resengrname)","v":""},null,null,null,null,null,null,null,null,null,null,null,null,null,"Count test values violating Rule 1 or Rule 2"]
[null,null,null,null,null,null,null,null,null,null,null,null,null,null,"Quality Control Manager:",{"$f":"IF(qcmanagername=\"\",\"\",qcmanagername)","v":""},null,null,null,null,"Contractor QC Mgr Job #:",{"$f":"IF(QCjobno=\"\",\"\",QCjobno)","v":""},null,null,null,null,null,null,null,"Code (for Rule 1): 0, 1, 2, 3, …….===> Number of times QC data out of tolerance"]
[null,null,null,null,null,null,null,null,null,null,null,null,null,null,"HMA Type:",{"$f":"IF(hmatype=\"\",\"\",hmatype)","v":"3/4\" HMA Type A"},null,null,null,null,"Contractor:",{"$f":"IF(contractorname=\"\",\"\",contractorname)","v":""},null,null,null,null,null,null,null,"Code (for Rule 2): 888 ===> QF less than 0.75; 999 ===> QF less than 0.9"]
[null,null,null,null,null,null,null,null,null,null,null,null,null,null,"JMF  No:",{"$f":"IF(jmf=\"\",\"\",jmf)","v":""},null,null,null,null,"HMA Plant:",{"$f":"IF(hmaplant=\"\",\"\",hmaplant)","v":""}]
[null,null,null,null,null,null,null,null,null,null,null,null,null,null,"Lot No:",{"$f":"IF(lotno=\"\",\"\",lotno)","v":""},null,null,null,null,"QC Lab:",{"$f":"IF(QClab=\"\",\"\",QClab)","v":""}]
[]
[null,null,null,null,null,null,null,null,null,null,"exported QCdata file name =>",{"$f":"dist_ea&\"_QCData\"   &\"_\"&jmf&\"_LotNo\"                                          &TEXT(lotno,\"00\")&\"_\"&(YEAR(TODAY())&\"-\"&TEXT(MONTH(TODAY()),\"dd\")&\"-\"&TEXT(DAY(TODAY()),\"dd\"))","v":"_QCData__LotNo00_2020-06-30"},null,null,null,null,null,null,null,null,null,null,null,null,null,null,null,null,null,"Documentation on logic used in this section:"]
[null,null,null,null,null,null,null,null,null,null,null,null,null,null,null,null,null,null,null,null,null,null,null,null,null,null,null,null,null,"If there is a weighting factor, and the test value is out of spec limits then cell equals 1, no reason to count number out in a row if a weighting factor exists."]
[null,null,null,null,null,null,null,null,null,null,null,null,null,null,null,null,null,null,null,null,null,null,null,null,null,null,null,null,null,"Otherwise cell could still have a weighting factor and test value is in spec, …. If so, then cell value is set to 0."]
[null,null,null,null,"Rule 1",null,"If no weighting factor, but has a specification limit, two failed tests in a row highlights red, requires stop production, terminate lot. Contrctor must also manually check for 3 consecutive in one day.",null,null,null,null,null,null,null,null,null,null,null,null,null,null,null,null,null,null,null,null,null,null,"Also, if charachteristic  not reportable (\"nr\"), or no spec limit exists,  but the values must be reported (\"nsl / mr\"), then also set the cell value equal to 0."]
[null,null,null,null,"Rule 2",null,"If weighting factor, a QFQC must be calculated. If cell goes red, QFQC is too low, stop production, terminate lot.",null,null,null,null,null,null,null,null,null,null,null,null,null,null,null,null,null,null,null,null,null,null,"If none of the above, then charachteristic has a spec limit, now count how many in a row are out of spec."]
[]
[null,null,null,null,"Rule 3",null,"No specification limits. Report test value only (per CT 202)",null,null,null,null,null,null,null,null,null,null,null,null,null,null,null,null,null,null,null,null,null,null,"Rule 1","If no weighting factor, but has spec limit, then two failed tests in a row requires ending lot."]
[null,null,null,null,"Rule 4",null,"3 Failing Tests in 1 Day",null,null,null,null,null,null,null,null,null,null,null,null,null,null,null,null,null,null,null,null,null,null,"Rule 2","If weighting factor, a QFQC must be calculated for the last 20 tests (including overlap from previous lots)",null,null,null,null,null,null,null,null,null,null,null,null,null,null,null,null,null,null,null,null,null,null,null,null,"n",{"$f":"COUNT(N30:N56)","v":0},{"$f":"COUNT(S30:S56)","v":0},{"$f":"COUNT(T30:T56)","v":0},{"$f":"COUNT(AA30:AA56)","v":0},{"$f":"COUNT(AB30:AB56)","v":0}]
[null,null,null,null,null,null,"2\"","1-1/2\"","1\"","3/4\"","1/2\"","3/8\"","#4","#8","#16","#30","#50","#100","#200","B.C.",null,null,null,null,null,null,"%MTD","% Air Voids",null,null,null,"The QFQC will also be calculated for on through 5, 5, …20 until twenty tests are recorded.",null,null,null,null,null,null,null,null,null,null,null,null,null,null,null,null,null,null,null,null,null,null,null,"Mean",{"$f":"AVERAGE(N30:N56)","v":{"$error":"#DIV/0!"}},{"$f":"AVERAGE(S30:S56)","v":{"$error":"#DIV/0!"}},{"$f":"AVERAGE(T30:T56)","v":{"$error":"#DIV/0!"}},{"$f":"AVERAGE(AA30:AA56)","v":{"$error":"#DIV/0!"}},{"$f":"AVERAGE(AB30:AB56)","v":{"$error":"#DIV/0!"}}]
[null,null,null,null,null,null,null,null,null,null,null,null,null,null,null,null,null,null,null,null,null,null,null,null,null,null,null,null,null,"Rule 3","No Specification Check Rules, Simply report value",null,null,null,null,null,null,null,null,null,null,null,null,null,null,null,null,null,null,null,null,null,null,null,null,"Std Dev",{"$f":"IF(_n8<3,\"\",STDEV(N30:N56))","v":""},{"$f":"IF(_n200<3,\"\",STDEV(S30:S56))","v":""},{"$f":"IF(_nBC<3,\"\",STDEV(T30:T56))","v":""},{"$f":"IF(_nMTD<3,\"\",STDEV(AA30:AA56))","v":""},{"$f":"IF(_nAV<3,\"\",STDEV(AB30:AB56))","v":""}]
[null,null,null,null,null,"JMF Target Value",null,{"$f":"IF(LotInfo!D27=\"\",\"\",LotInfo!D27)","v":""},{"$f":"IF(LotInfo!E27=\"\",\"\",LotInfo!E27)","v":""},{"$f":"IF(LotInfo!F27=\"\",\"\",LotInfo!F27)","v":""},{"$f":"IF(LotInfo!G27=\"\",\"\",LotInfo!G27)","v":""},{"$f":"IF(LotInfo!H27=\"\",\"\",LotInfo!H27)","v":""},{"$f":"IF(LotInfo!I27=\"\",\"\",LotInfo!I27)","v":""},{"$f":"IF(LotInfo!J27=\"\",\"\",LotInfo!J27)","v":""},{"$f":"IF(LotInfo!K27=\"\",\"\",LotInfo!K27)","v":""},{"$f":"IF(LotInfo!L27=\"\",\"\",LotInfo!L27)","v":""},{"$f":"IF(LotInfo!M27=\"\",\"\",LotInfo!M27)","v":""},{"$f":"IF(LotInfo!N27=\"\",\"\",LotInfo!N27)","v":""},{"$f":"IF(LotInfo!O27=\"\",\"\",LotInfo!O27)","v":""},{"$f":"IF(LotInfo!P27=\"\",\"\",LotInfo!P27)","v":""},null,null,null,null,null,null,{"$f":"IF(LotInfo!Q27=\"\",\"\",LotInfo!Q27)","v":""},{"$f":"IF(LotInfo!R27=\"\",\"\",LotInfo!R27)","v":4},null,"Rule 4","No reporting required.",null,null,null,null,null,null,null,null,null,null,null,null,null,null,null,null,null,null,null,null,null,null,null,null,null,"#8","#200","B.C.","%MTD","%AV"]
[null,null,null,null,null,"Production Tolerance",{"$f":"LotInfo!C29","v":""},{"$f":"LotInfo!D29","v":""},{"$f":"LotInfo!E29","v":0},{"$f":"LotInfo!F29","v":5},{"$f":"LotInfo!G29","v":6},{"$f":"LotInfo!H29","v":"nsl / mr"},{"$f":"LotInfo!I29","v":5},{"$f":"LotInfo!J29","v":5},{"$f":"LotInfo!K29","v":"nsl / mr"},{"$f":"LotInfo!L29","v":4},{"$f":"LotInfo!M29","v":"nsl / mr"},{"$f":"LotInfo!N29","v":"nsl / mr"},{"$f":"LotInfo!O29","v":2},{"$f":"LotInfo!P29","v":0.4},null,null,null,null,null,null,null,null,null,null,null,null,null,null,null,null,null,null,null,null,null,null,null,null,null,null,null,null,null,null,null,null,null,null,null,"index (i)=",1,2,3,5,4]
[null,null,null,null,null,"Upper Specification Limit",{"$f":"LotInfo!C30","v":""},{"$f":"LotInfo!D30","v":""},{"$f":"LotInfo!E30","v":""},{"$f":"LotInfo!F30","v":""},{"$f":"LotInfo!G30","v":""},{"$f":"LotInfo!H30","v":""},{"$f":"LotInfo!I30","v":""},{"$f":"LotInfo!J30","v":""},{"$f":"LotInfo!K30","v":""},{"$f":"LotInfo!L30","v":""},{"$f":"LotInfo!M30","v":""},{"$f":"LotInfo!N30","v":""},{"$f":"LotInfo!O30","v":""},{"$f":"LotInfo!P30","v":""},null,null,null,null,null,null,{"$f":"LotInfo!Q30","v":96},{"$f":"LotInfo!R30","v":5.5},null,{"$f":"F21","v":"Upper Specification Limit"},{"$f":"LotInfo!C30","v":""},{"$f":"LotInfo!D30","v":""},{"$f":"LotInfo!E30","v":""},{"$f":"LotInfo!F30","v":""},{"$f":"LotInfo!G30","v":""},{"$f":"LotInfo!H30","v":""},{"$f":"LotInfo!I30","v":""},{"$f":"LotInfo!J30","v":""},{"$f":"LotInfo!K30","v":""},{"$f":"LotInfo!L30","v":""},{"$f":"LotInfo!M30","v":""},{"$f":"LotInfo!N30","v":""},{"$f":"LotInfo!O30","v":""},{"$f":"LotInfo!P30","v":""},{"$f":"LotInfo!Q30","v":96},{"$f":"LotInfo!R30","v":5.5},null,null,{"$f":"LotInfo!J30","v":""},{"$f":"LotInfo!O30","v":""},{"$f":"LotInfo!P30","v":""},{"$f":"LotInfo!Q30","v":96},{"$f":"LotInfo!R30","v":5.5},null,null,"Upper Specification Limit",{"$f":"LotInfo!J30","v":""},{"$f":"LotInfo!O30","v":""},{"$f":"LotInfo!P30","v":""},{"$f":"LotInfo!Q30","v":96},{"$f":"LotInfo!R30","v":5.5}]
[null,null,null,null,null,"Lower Specification Limit",{"$f":"LotInfo!C31","v":""},{"$f":"LotInfo!D31","v":""},{"$f":"LotInfo!E31","v":""},{"$f":"LotInfo!F31","v":""},{"$f":"LotInfo!G31","v":""},{"$f":"LotInfo!H31","v":""},{"$f":"LotInfo!I31","v":""},{"$f":"LotInfo!J31","v":""},{"$f":"LotInfo!K31","v":""},{"$f":"LotInfo!L31","v":""},{"$f":"LotInfo!M31","v":""},{"$f":"LotInfo!N31","v":""},{"$f":"LotInfo!O31","v":""},{"$f":"LotInfo!P31","v":""},null,null,null,null,null,null,{"$f":"LotInfo!Q31","v":92},{"$f":"LotInfo!R31","v":2.5},null,{"$f":"F22","v":"Lower Specification Limit"},{"$f":"LotInfo!C31","v":""},{"$f":"LotInfo!D31","v":""},{"$f":"LotInfo!E31","v":""},{"$f":"LotInfo!F31","v":""},{"$f":"LotInfo!G31","v":""},{"$f":"LotInfo!H31","v":""},{"$f":"LotInfo!I31","v":""},{"$f":"LotInfo!J31","v":""},{"$f":"LotInfo!K31","v":""},{"$f":"LotInfo!L31","v":""},{"$f":"LotInfo!M31","v":""},{"$f":"LotInfo!N31","v":""},{"$f":"LotInfo!O31","v":""},{"$f":"LotInfo!P31","v":""},{"$f":"LotInfo!Q31","v":92},{"$f":"LotInfo!R31","v":2.5},null,null,{"$f":"LotInfo!J31","v":""},{"$f":"LotInfo!O31","v":""},{"$f":"LotInfo!P31","v":""},{"$f":"LotInfo!Q31","v":92},{"$f":"LotInfo!R31","v":2.5},null,null,"Lower Specification Limit",{"$f":"LotInfo!J31","v":""},{"$f":"LotInfo!O31","v":""},{"$f":"LotInfo!P31","v":""},{"$f":"LotInfo!Q31","v":92},{"$f":"LotInfo!R31","v":2.5}]
[null,null,null,null,null,{"$f":"LotInfo!B32","v":"Weighting Factor   (w)"},null,null,null,null,null,null,null,{"$f":"LotInfo!J32","v":0.05},null,null,null,null,{"$f":"LotInfo!O32","v":0.1},{"$f":"LotInfo!P32","v":0.25},null,null,null,null,null,null,{"$f":"LotInfo!Q32","v":0.4},{"$f":"LotInfo!R32","v":0.2},null,{"$f":"LotInfo!B32","v":"Weighting Factor   (w)"},{"$f":"LotInfo!C32","v":0},{"$f":"LotInfo!D32","v":0},{"$f":"LotInfo!E32","v":0},{"$f":"LotInfo!F32","v":0},{"$f":"LotInfo!G32","v":0},{"$f":"LotInfo!H32","v":0},{"$f":"LotInfo!I32","v":0},{"$f":"LotInfo!J32","v":0.05},{"$f":"LotInfo!K32","v":0},{"$f":"LotInfo!L32","v":0},{"$f":"LotInfo!M32","v":0},{"$f":"LotInfo!N32","v":0},{"$f":"LotInfo!O32","v":0.1},{"$f":"LotInfo!P32","v":0.25},{"$f":"LotInfo!Q32","v":0.4},{"$f":"LotInfo!R32","v":0.2},null,null,{"$f":"LotInfo!J32","v":0.05},{"$f":"LotInfo!O32","v":0.1},{"$f":"LotInfo!P32","v":0.25},{"$f":"LotInfo!Q32","v":0.4},{"$f":"LotInfo!R32","v":0.2},null,null,"Weighting Factor   (w)",{"$f":"LotInfo!J32","v":0.05},{"$f":"LotInfo!O32","v":0.1},{"$f":"LotInfo!P32","v":0.25},{"$f":"LotInfo!Q32","v":0.4},{"$f":"LotInfo!R32","v":0.2}]
[null,null,null,null,null,"Rule used to check Quality",{"$f":"IF(LotInfo!C29=\"\",\"\",IF((AND(G$22=\"nsl / mr\", G$23=0)),rule3,IF(G$23=0,rule1,rule2)))","v":""},{"$f":"IF(LotInfo!D29=\"\",\"\",IF((AND(H$22=\"nsl / mr\", H$23=0)),rule3,IF(H$23=0,rule1,rule2)))","v":""},{"$f":"IF(LotInfo!E29=\"\",\"\",IF((AND(I$22=\"nsl / mr\", I$23=0)),rule3,IF(I$23=0,rule1,rule2)))","v":"Rule 1"},{"$f":"IF(LotInfo!F29=\"\",\"\",IF((AND(J$22=\"nsl / mr\", J$23=0)),rule3,IF(J$23=0,rule1,rule2)))","v":"Rule 1"},{"$f":"IF(LotInfo!G29=\"\",\"\",IF((AND(K$22=\"nsl / mr\", K$23=0)),rule3,IF(K$23=0,rule1,rule2)))","v":"Rule 1"},{"$f":"IF(LotInfo!H29=\"\",\"\",IF((AND(L$22=\"nsl / mr\", L$23=0)),rule3,IF(L$23=0,rule1,rule2)))","v":"Rule 1"},{"$f":"IF(LotInfo!I29=\"\",\"\",IF((AND(M$22=\"nsl / mr\", M$23=0)),rule3,IF(M$23=0,rule1,rule2)))","v":"Rule 1"},{"$f":"IF(LotInfo!J29=\"\",\"\",IF((AND(N$22=\"nsl / mr\", N$23=0)),rule3,IF(N$23=0,rule1,rule2)))","v":"Rule 2"},{"$f":"IF(LotInfo!K29=\"\",\"\",IF((AND(O$22=\"nsl / mr\", O$23=0)),rule3,IF(O$23=0,rule1,rule2)))","v":"Rule 1"},{"$f":"IF(LotInfo!L29=\"\",\"\",IF((AND(P$22=\"nsl / mr\", P$23=0)),rule3,IF(P$23=0,rule1,rule2)))","v":"Rule 1"},{"$f":"IF(LotInfo!M29=\"\",\"\",IF((AND(Q$22=\"nsl / mr\", Q$23=0)),rule3,IF(Q$23=0,rule1,rule2)))","v":"Rule 1"},{"$f":"IF(LotInfo!N29=\"\",\"\",IF((AND(R$22=\"nsl / mr\", R$23=0)),rule3,IF(R$23=0,rule1,rule2)))","v":"Rule 1"},{"$f":"IF(LotInfo!O29=\"\",\"\",IF((AND(S$22=\"nsl / mr\", S$23=0)),rule3,IF(S$23=0,rule1,rule2)))","v":"Rule 2"},{"$f":"IF(LotInfo!P29=\"\",\"\",IF((AND(T$22=\"nsl / mr\", T$23=0)),rule3,IF(T$23=0,rule1,rule2)))","v":"Rule 2"},null,null,null,null,null,null,{"$f":"IF((AND(AA$22=\"nsl / mr\", AA$23=0)),rule3,IF(AA$23=0,rule1,rule2))","v":"Rule 2"},{"$f":"IF((AND(AB$22=\"nsl / mr\", AB$23=0)),rule3,IF(AB$23=0,rule1,rule2))","v":"Rule 2"},null,null,{"$f":"G24","v":""},"","Rule 1","Rule 1","Rule 1","Rule 1","Rule 1","Rule 2","Rule 1","Rule 1","Rule 1","Rule 1","Rule 2","Rule 2",{"$f":"AA24","v":"Rule 2"},{"$f":"AB24","v":"Rule 2"},null,null,{"$f":"N24","v":"Rule 2"},{"$f":"S24","v":"Rule 2"},{"$f":"T24","v":"Rule 2"},{"$f":"AA24","v":"Rule 2"},{"$f":"AB24","v":"Rule 2"},null,null,null,{"$f":"N24","v":"Rule 2"},{"$f":"S24","v":"Rule 2"},{"$f":"T24","v":"Rule 2"},{"$f":"AA24","v":"Rule 2"},{"$f":"AB24","v":"Rule 2"}]
[null,null,null,null,null,"Quality Characteristic","2\"","1-1/2\"","1\"","3/4\"","1/2\"","3/8\"","#4","#8","#16","#30","#50","#100","#200","B.C.",null,null,null,null,null,null,"%MTD","% Air Voids",null,"Quality Characteristic","2\"","1-1/2\"","1\"","3/4\"","1/2\"","3/8\"","#4","#8","#16","#30","#50","#100","#200","B.C.","%MTD","Air Voids",null,null,"#8","#200","B.C.","%MTD","Air Voids",null,null,"Quality Characteristic","#8","#200","B.C.","%MTD","%AV"]
[null,null,null,null,null,null,null,null,null,null,null,null,null,"QFqc1 in Column BE",null,null,null,null,"QFqc2 in Column BF","QFqc3 in Column BG",null,null,null,null,null,null,"QFqc5 in Column BH","QFqc4 in Column BI",null,null,null,null,null,null,null,null,null,null,null,null,null,null,null,null,null,null,null,null,null,null,null,null,null,null,null,null,"QFqci= [(0.5 x PWLqci) + 55]"]
["TEST NO.","Date","Tons in sublot","Lot No.","Sublot No","3 Out",null,null,null,null,null,null,null,null,null,null,null,null,null,null,null,null,null,null,null,null,null,null,null,null,null,null,null,null,null,null,null,"Beta PWL UL Xs",null,null,null,null,null,null,null,null,null,null,null,null,"Beta PWL LL Xs",null,null,null,null,null,"Running","Running","Running","Running","Running","Running"]
[null,"(Beg of ","using Method",null,null,"in 1 Day?",null,null,null,null,null,null,null,null,null,null,null,null,null,null,"%MTD","%MTD","%MTD","Briquette 1","Briquette 2","Briquette 3","Average","Average",null,null,null,null,null,null,null,null,null,null,null,null,null,null,null,null,null,null,null,null,null,null,null,null,null,null,null,null,"QFqc1","QFqc2","QFqc3","QFqc5","QFqc4","Composite"]
[null,"sublot)","Compaction",null,null,"Yes or NO","2\"","1-1/2\"","1\"","3/4\"","1/2\"","3/8\"","#4","#8","#16","#30","#50","#100","#200","B.C.","Core 1","Core 2","Core 3","Air Voids","Air Voids","Air Voids","%MTD","Air Voids",null,null,null,null,null,null,null,null,null,null,null,null,null,null,null,null,null,null,null,null,null,null,null,null,null,null,null,null,"#8","#200","B.C.","%MTD","%AV","QFc"]
[null,null,null,null,null,null,null,null,null,null,null,null,null,null,null,null,null,null,null,null,null,null,null,null,null,null,{"$f":"IF(OR(U30=\"\",V30=\"\",W30=\"\"),\"\",AVERAGE(U30:W30))","v":""},{"$f":"IF(OR(X30=\"\",Y30=\"\",Z30=\"\"),\"\",AVERAGE(X30:Z30))","v":""},null,null,{"$f":" IF((AND(AE$24=rule1,AND(G30>0.01,OR(G30>AE$21,G30<AE$22)))),AE29+1,0)","v":0},{"$f":" IF((AND(AF$24=rule1,AND(H30>0.01,OR(H30>AF$21,H30<AF$22)))),AF29+1,0)","v":0},{"$f":" IF((AND(AG$24=rule1,AND(I30>0.01,OR(I30>AG$21,I30<AG$22)))),AG29+1,0)","v":0},{"$f":" IF((AND(AH$24=rule1,AND(J30>0.01,OR(J30>AH$21,J30<AH$22)))),AH29+1,0)","v":0},{"$f":" IF((AND(AI$24=rule1,AND(K30>0.01,OR(K30>AI$21,K30<AI$22)))),AI29+1,0)","v":0},{"$f":" IF((AND(AJ$24=rule1,AND(L30>0.01,OR(L30>AJ$21,L30<AJ$22)))),AJ29+1,0)","v":0},{"$f":" IF((AND(AK$24=rule1,AND(M30>0.01,OR(M30>AK$21,M30<AK$22)))),AK29+1,0)","v":0},"No Calc",{"$f":" IF((AND(AM$24=rule1,AND(O30>0.01,OR(O30>AM$21,O30<AM$22)))),AM29+1,0)","v":0},{"$f":" IF((AND(AN$24=rule1,AND(P30>0.01,OR(P30>AN$21,P30<AN$22)))),AN29+1,0)","v":0},{"$f":" IF((AND(AO$24=rule1,AND(Q30>0.01,OR(Q30>AO$21,Q30<AO$22)))),AO29+1,0)","v":0},{"$f":" IF((AND(AP$24=rule1,AND(R30>0.01,OR(R30>AP$21,R30<AP$22)))),AP29+1,0)","v":0},"No Calc","No Calc","No Calc","No Calc",null,null,"No Calc","No Calc","No Calc","No Calc","No Calc",null,null,null,"No Calc","No Calc","No Calc","No Calc","No Calc","No Calc"]
[null,null,null,null,null,null,null,null,null,null,null,null,null,null,null,null,null,null,null,null,null,null,null,null,null,null,"","",null,null,0,0,0,0,0,0,0,"No Calc",0,0,0,0,"No Calc","No Calc","No Calc","No Calc",null,null,"No Calc","No Calc","No Calc","No Calc","No Calc",null,null,null,"No Calc","No Calc","No Calc","No Calc","No Calc","No Calc"]
[null,null,null,null,null,null,null,null,null,null,null,null,null,null,null,null,null,null,null,null,null,null,null,null,null,null,"","",null,null,0,0,0,0,0,0,0,{"$f":"IF((MAX(0,(0.5-(($AL$21-AVERAGE($N$30:N32))/(IF(STDEV($N$30:N32)<0.01,0.01,STDEV($N$30:N32)))*SQRT(COUNT($N$30:N32))/(2*(COUNT($N$30:N32)-1))))))>1,1,(MAX(0,(0.5-(($AL$21-AVERAGE($N$30:N32))/(IF(STDEV($N$30:N32)<0.01,0.01,STDEV($N$30:N32)))*SQRT(COUNT($N$30:N32))/(2*(COUNT($N$30:N32)-1)))))))","v":{"$error":"#VALUE!"}},0,0,0,0,{"$f":"IF((MAX(0,(0.5-(($AQ$21-AVERAGE($S$30:S32))/(IF(STDEV($S$30:S32)<0.01,0.01,STDEV($S$30:S32)))*SQRT(COUNT($S$30:S32))/(2*(COUNT($S$30:S32)-1))))))>1,1,(MAX(0,(0.5-(($AQ$21-AVERAGE($S$30:S32))/(IF(STDEV($S$30:S32)<0.01,0.01,STDEV($S$30:S32)))*SQRT(COUNT($S$30:S32))/(2*(COUNT($S$30:S32)-1)))))))","v":{"$error":"#VALUE!"}},{"$f":"IF((MAX(0,(0.5-(($AR$21-AVERAGE($T$30:T32))/(IF(STDEV($T$30:T32)<0.01,0.01,STDEV($T$30:T32)))*SQRT(COUNT($T$30:T32))/(2*(COUNT($T$30:T32)-1))))))>1,1,(MAX(0,(0.5-(($AR$21-AVERAGE($T$30:T32))/(IF(STDEV($T$30:T32)<0.01,0.01,STDEV($T$30:T32)))*SQRT(COUNT($T$30:T32))/(2*(COUNT($T$30:T32)-1)))))))","v":{"$error":"#VALUE!"}},{"$f":"IF((MAX(0,(0.5-(($AS$21-AVERAGE($AA$30:AA32))/(IF(STDEV($AA$30:AA32)<0.01,0.01,STDEV($AA$30:AA32)))*SQRT(COUNT($AA$30:AA32))/(2*(COUNT($AA$30:AA32)-1))))))>1,1,(MAX(0,(0.5-(($AS$21-AVERAGE($AA$30:AA32))/(IF(STDEV($AA$30:AA32)<0.01,0.01,STDEV($AA$30:AA32)))*SQRT(COUNT($AA$30:AA32))/(2*(COUNT($AA$30:AA32)-1)))))))","v":{"$error":"#DIV/0!"}},{"$f":"IF((MAX(0,(0.5-(($AT$21-AVERAGE($AB$30:AB32))/(IF(STDEV($AB$30:AB32)<0.01,0.01,STDEV($AB$30:AB32)))*SQRT(COUNT($AB$30:AB32))/(2*(COUNT($AB$30:AB32)-1))))))>1,1,(MAX(0,(0.5-(($AT$21-AVERAGE($AB$30:AB32))/(IF(STDEV($AB$30:AB32)<0.01,0.01,STDEV($AB$30:AB32)))*SQRT(COUNT($AB$30:AB32))/(2*(COUNT($AB$30:AB32)-1)))))))","v":{"$error":"#DIV/0!"}},null,null,{"$f":"IF((MAX(0,(0.5-((AVERAGE($N$30:N32)-$AW$22)/(IF(STDEV($N$30:N32)<0.01,0.01,STDEV($N$30:N32)))*SQRT(COUNT($N$30:N32))/(2*(COUNT($N$30:N32)-1))))))>1,1,(MAX(0,(0.5-((AVERAGE($N$30:N32)-$AW$22)/(IF(STDEV($N$30:N32)<0.01,0.01,STDEV($N$30:N32)))*SQRT(COUNT($N$30:N32))/(2*(COUNT($N$30:N32)-1)))))))","v":{"$error":"#DIV/0!"}},{"$f":"IF((MAX(0,(0.5-((AVERAGE($S$30:S32)-$AX$22)/(IF(STDEV($S$30:S32)<0.01,0.01,STDEV($S$30:S32)))*SQRT(COUNT($S$30:S32))/(2*(COUNT($S$30:S32)-1))))))>1,1,(MAX(0,(0.5-((AVERAGE($S$30:S32)-$AX$22)/(IF(STDEV($S$30:S32)<0.01,0.01,STDEV($S$30:S32)))*SQRT(COUNT($S$30:S32))/(2*(COUNT($S$30:S32)-1)))))))","v":{"$error":"#DIV/0!"}},{"$f":"IF((MAX(0,(0.5-((AVERAGE($T$30:T32)-$AY$22)/(IF(STDEV($T$30:T32)<0.01,0.01,STDEV($T$30:T32)))*SQRT(COUNT($T$30:T32))/(2*(COUNT($T$30:T32)-1))))))>1,1,(MAX(0,(0.5-((AVERAGE($T$30:T32)-$AY$22)/(IF(STDEV($T$30:T32)<0.01,0.01,STDEV($T$30:T32)))*SQRT(COUNT($T$30:T32))/(2*(COUNT($T$30:T32)-1)))))))","v":{"$error":"#DIV/0!"}},{"$f":"IF((MAX(0,(0.5-((AVERAGE($AA$30:AA32)-$AZ$22)/(IF(STDEV($AA$30:AA32)<0.01,0.01,STDEV($AA$30:AA32)))*SQRT(COUNT($AA$30:AA32))/(2*(COUNT($AA$30:AA32)-1))))))>1,1,(MAX(0,(0.5-((AVERAGE($AA$30:AA32)-$AZ$22)/(IF(STDEV($AA$30:AA32)<0.01,0.01,STDEV($AA$30:AA32)))*SQRT(COUNT($AA$30:AA32))/(2*(COUNT($AA$30:AA32)-1)))))))","v":{"$error":"#DIV/0!"}},{"$f":"IF((MAX(0,(0.5-((AVERAGE($AB$30:AB32)-$BA$22)/(IF(STDEV($AB$30:AB32)<0.01,0.01,STDEV($AB$30:AB32)))*SQRT(COUNT($AB$30:AB32))/(2*(COUNT($AB$30:AB32)-1))))))>1,1,(MAX(0,(0.5-((AVERAGE($AB$30:AB32)-$BA$22)/(IF(STDEV($AB$30:AB32)<0.01,0.01,STDEV($AB$30:AB32)))*SQRT(COUNT($AB$30:AB32))/(2*(COUNT($AB$30:AB32)-1)))))))","v":{"$error":"#DIV/0!"}},null,null,null,{"$f":"(0.5 * ((100-(BETADIST(AL32,((COUNT(N$30:N32))/2)-1,((COUNT(N$30:N32))/2)-1))*100) + (100-(BETADIST(AW32,((COUNT(N$30:N32))/2)-1,((COUNT(N$30:N32))/2)-1))*100) - 100) + 55) / 100","v":{"$error":"#VALUE!"}},{"$f":"(0.5 * ((100-(BETADIST(AQ32,((COUNT(S$30:S32))/2)-1,((COUNT(S$30:S32))/2)-1))*100) + (100-(BETADIST(AX32,((COUNT(S$30:S32))/2)-1,((COUNT(S$30:S32))/2)-1))*100) - 100) + 55) / 100","v":{"$error":"#VALUE!"}},{"$f":"(0.5 * ((100-(BETADIST(AR32,((COUNT(T$30:T32))/2)-1,((COUNT(T$30:T32))/2)-1))*100) + (100-(BETADIST(AY32,((COUNT(T$30:T32))/2)-1,((COUNT(T$30:T32))/2)-1))*100) - 100) + 55) / 100","v":{"$error":"#VALUE!"}},{"$f":"(0.5 * ((100-(BETADIST(AS32,((COUNT(AA$30:AA32))/2)-1,((COUNT(AA$30:AA32))/2)-1))*100) + (100-(BETADIST(AZ32,((COUNT(AA$30:AA32))/2)-1,((COUNT(AA$30:AA32))/2)-1))*100) - 100) + 55) / 100","v":{"$error":"#DIV/0!"}},{"$f":"(0.5 * ((100-(BETADIST(AT32,((COUNT(AB$30:AB32))/2)-1,((COUNT(AB$30:AB32))/2)-1))*100) + (100-(BETADIST(BA32,((COUNT(AB$30:AB32))/2)-1,((COUNT(AB$30:AB32))/2)-1))*100) - 100) + 55) / 100","v":{"$error":"#DIV/0!"}},{"$f":"(BE32*BE$23)+(BF32*BF$23)+(BG32*BG$23)+(BH32*BH$23)+(BI32*BI$23)","v":{"$error":"#VALUE!"}}]
[null,null,null,null,null,null,null,null,null,null,null,null,null,null,null,null,null,null,null,null,null,null,null,null,null,null,"","",null,null,0,0,0,0,0,0,0,{"$f":"IF((MAX(0,(0.5-(($AL$21-AVERAGE($N$30:N33))/(IF(STDEV($N$30:N33)<0.01,0.01,STDEV($N$30:N33)))*SQRT(COUNT($N$30:N33))/(2*(COUNT($N$30:N33)-1))))))>1,1,(MAX(0,(0.5-(($AL$21-AVERAGE($N$30:N33))/(IF(STDEV($N$30:N33)<0.01,0.01,STDEV($N$30:N33)))*SQRT(COUNT($N$30:N33))/(2*(COUNT($N$30:N33)-1)))))))","v":{"$error":"#VALUE!"}},0,0,0,0,{"$f":"IF((MAX(0,(0.5-(($AQ$21-AVERAGE($S$30:S33))/(IF(STDEV($S$30:S33)<0.01,0.01,STDEV($S$30:S33)))*SQRT(COUNT($S$30:S33))/(2*(COUNT($S$30:S33)-1))))))>1,1,(MAX(0,(0.5-(($AQ$21-AVERAGE($S$30:S33))/(IF(STDEV($S$30:S33)<0.01,0.01,STDEV($S$30:S33)))*SQRT(COUNT($S$30:S33))/(2*(COUNT($S$30:S33)-1)))))))","v":{"$error":"#VALUE!"}},{"$f":"IF((MAX(0,(0.5-(($AR$21-AVERAGE($T$30:T33))/(IF(STDEV($T$30:T33)<0.01,0.01,STDEV($T$30:T33)))*SQRT(COUNT($T$30:T33))/(2*(COUNT($T$30:T33)-1))))))>1,1,(MAX(0,(0.5-(($AR$21-AVERAGE($T$30:T33))/(IF(STDEV($T$30:T33)<0.01,0.01,STDEV($T$30:T33)))*SQRT(COUNT($T$30:T33))/(2*(COUNT($T$30:T33)-1)))))))","v":{"$error":"#VALUE!"}},{"$f":"IF((MAX(0,(0.5-(($AS$21-AVERAGE($AA$30:AA33))/(IF(STDEV($AA$30:AA33)<0.01,0.01,STDEV($AA$30:AA33)))*SQRT(COUNT($AA$30:AA33))/(2*(COUNT($AA$30:AA33)-1))))))>1,1,(MAX(0,(0.5-(($AS$21-AVERAGE($AA$30:AA33))/(IF(STDEV($AA$30:AA33)<0.01,0.01,STDEV($AA$30:AA33)))*SQRT(COUNT($AA$30:AA33))/(2*(COUNT($AA$30:AA33)-1)))))))","v":{"$error":"#DIV/0!"}},{"$f":"IF((MAX(0,(0.5-(($AT$21-AVERAGE($AB$30:AB33))/(IF(STDEV($AB$30:AB33)<0.01,0.01,STDEV($AB$30:AB33)))*SQRT(COUNT($AB$30:AB33))/(2*(COUNT($AB$30:AB33)-1))))))>1,1,(MAX(0,(0.5-(($AT$21-AVERAGE($AB$30:AB33))/(IF(STDEV($AB$30:AB33)<0.01,0.01,STDEV($AB$30:AB33)))*SQRT(COUNT($AB$30:AB33))/(2*(COUNT($AB$30:AB33)-1)))))))","v":{"$error":"#DIV/0!"}},null,null,{"$f":"IF((MAX(0,(0.5-((AVERAGE($N$30:N33)-$AW$22)/(IF(STDEV($N$30:N33)<0.01,0.01,STDEV($N$30:N33)))*SQRT(COUNT($N$30:N33))/(2*(COUNT($N$30:N33)-1))))))>1,1,(MAX(0,(0.5-((AVERAGE($N$30:N33)-$AW$22)/(IF(STDEV($N$30:N33)<0.01,0.01,STDEV($N$30:N33)))*SQRT(COUNT($N$30:N33))/(2*(COUNT($N$30:N33)-1)))))))","v":{"$error":"#DIV/0!"}},{"$f":"IF((MAX(0,(0.5-((AVERAGE($S$30:S33)-$AX$22)/(IF(STDEV($S$30:S33)<0.01,0.01,STDEV($S$30:S33)))*SQRT(COUNT($S$30:S33))/(2*(COUNT($S$30:S33)-1))))))>1,1,(MAX(0,(0.5-((AVERAGE($S$30:S33)-$AX$22)/(IF(STDEV($S$30:S33)<0.01,0.01,STDEV($S$30:S33)))*SQRT(COUNT($S$30:S33))/(2*(COUNT($S$30:S33)-1)))))))","v":{"$error":"#DIV/0!"}},{"$f":"IF((MAX(0,(0.5-((AVERAGE($T$30:T33)-$AY$22)/(IF(STDEV($T$30:T33)<0.01,0.01,STDEV($T$30:T33)))*SQRT(COUNT($T$30:T33))/(2*(COUNT($T$30:T33)-1))))))>1,1,(MAX(0,(0.5-((AVERAGE($T$30:T33)-$AY$22)/(IF(STDEV($T$30:T33)<0.01,0.01,STDEV($T$30:T33)))*SQRT(COUNT($T$30:T33))/(2*(COUNT($T$30:T33)-1)))))))","v":{"$error":"#DIV/0!"}},{"$f":"IF((MAX(0,(0.5-((AVERAGE($AA$30:AA33)-$AZ$22)/(IF(STDEV($AA$30:AA33)<0.01,0.01,STDEV($AA$30:AA33)))*SQRT(COUNT($AA$30:AA33))/(2*(COUNT($AA$30:AA33)-1))))))>1,1,(MAX(0,(0.5-((AVERAGE($AA$30:AA33)-$AZ$22)/(IF(STDEV($AA$30:AA33)<0.01,0.01,STDEV($AA$30:AA33)))*SQRT(COUNT($AA$30:AA33))/(2*(COUNT($AA$30:AA33)-1)))))))","v":{"$error":"#DIV/0!"}},{"$f":"IF((MAX(0,(0.5-((AVERAGE($AB$30:AB33)-$BA$22)/(IF(STDEV($AB$30:AB33)<0.01,0.01,STDEV($AB$30:AB33)))*SQRT(COUNT($AB$30:AB33))/(2*(COUNT($AB$30:AB33)-1))))))>1,1,(MAX(0,(0.5-((AVERAGE($AB$30:AB33)-$BA$22)/(IF(STDEV($AB$30:AB33)<0.01,0.01,STDEV($AB$30:AB33)))*SQRT(COUNT($AB$30:AB33))/(2*(COUNT($AB$30:AB33)-1)))))))","v":{"$error":"#DIV/0!"}},null,null,null,{"$f":"(0.5 * ((100-(BETADIST(AL33,((COUNT(N$30:N33))/2)-1,((COUNT(N$30:N33))/2)-1))*100) + (100-(BETADIST(AW33,((COUNT(N$30:N33))/2)-1,((COUNT(N$30:N33))/2)-1))*100) - 100) + 55) / 100","v":{"$error":"#VALUE!"}},{"$f":"(0.5 * ((100-(BETADIST(AQ33,((COUNT(S$30:S33))/2)-1,((COUNT(S$30:S33))/2)-1))*100) + (100-(BETADIST(AX33,((COUNT(S$30:S33))/2)-1,((COUNT(S$30:S33))/2)-1))*100) - 100) + 55) / 100","v":{"$error":"#VALUE!"}},{"$f":"(0.5 * ((100-(BETADIST(AR33,((COUNT(T$30:T33))/2)-1,((COUNT(T$30:T33))/2)-1))*100) + (100-(BETADIST(AY33,((COUNT(T$30:T33))/2)-1,((COUNT(T$30:T33))/2)-1))*100) - 100) + 55) / 100","v":{"$error":"#VALUE!"}},{"$f":"(0.5 * ((100-(BETADIST(AS33,((COUNT(AA$30:AA33))/2)-1,((COUNT(AA$30:AA33))/2)-1))*100) + (100-(BETADIST(AZ33,((COUNT(AA$30:AA33))/2)-1,((COUNT(AA$30:AA33))/2)-1))*100) - 100) + 55) / 100","v":{"$error":"#DIV/0!"}},{"$f":"(0.5 * ((100-(BETADIST(AT33,((COUNT(AB$30:AB33))/2)-1,((COUNT(AB$30:AB33))/2)-1))*100) + (100-(BETADIST(BA33,((COUNT(AB$30:AB33))/2)-1,((COUNT(AB$30:AB33))/2)-1))*100) - 100) + 55) / 100","v":{"$error":"#DIV/0!"}},{"$error":"#VALUE!"}]
[null,null,null,null,null,null,null,null,null,null,null,null,null,null,null,null,null,null,null,null,null,null,null,null,null,null,"","",null,null,0,0,0,0,0,0,0,{"$f":"IF((MAX(0,(0.5-(($AL$21-AVERAGE($N$30:N34))/(IF(STDEV($N$30:N34)<0.01,0.01,STDEV($N$30:N34)))*SQRT(COUNT($N$30:N34))/(2*(COUNT($N$30:N34)-1))))))>1,1,(MAX(0,(0.5-(($AL$21-AVERAGE($N$30:N34))/(IF(STDEV($N$30:N34)<0.01,0.01,STDEV($N$30:N34)))*SQRT(COUNT($N$30:N34))/(2*(COUNT($N$30:N34)-1)))))))","v":{"$error":"#VALUE!"}},0,0,0,0,{"$f":"IF((MAX(0,(0.5-(($AQ$21-AVERAGE($S$30:S34))/(IF(STDEV($S$30:S34)<0.01,0.01,STDEV($S$30:S34)))*SQRT(COUNT($S$30:S34))/(2*(COUNT($S$30:S34)-1))))))>1,1,(MAX(0,(0.5-(($AQ$21-AVERAGE($S$30:S34))/(IF(STDEV($S$30:S34)<0.01,0.01,STDEV($S$30:S34)))*SQRT(COUNT($S$30:S34))/(2*(COUNT($S$30:S34)-1)))))))","v":{"$error":"#VALUE!"}},{"$f":"IF((MAX(0,(0.5-(($AR$21-AVERAGE($T$30:T34))/(IF(STDEV($T$30:T34)<0.01,0.01,STDEV($T$30:T34)))*SQRT(COUNT($T$30:T34))/(2*(COUNT($T$30:T34)-1))))))>1,1,(MAX(0,(0.5-(($AR$21-AVERAGE($T$30:T34))/(IF(STDEV($T$30:T34)<0.01,0.01,STDEV($T$30:T34)))*SQRT(COUNT($T$30:T34))/(2*(COUNT($T$30:T34)-1)))))))","v":{"$error":"#VALUE!"}},{"$f":"IF((MAX(0,(0.5-(($AS$21-AVERAGE($AA$30:AA34))/(IF(STDEV($AA$30:AA34)<0.01,0.01,STDEV($AA$30:AA34)))*SQRT(COUNT($AA$30:AA34))/(2*(COUNT($AA$30:AA34)-1))))))>1,1,(MAX(0,(0.5-(($AS$21-AVERAGE($AA$30:AA34))/(IF(STDEV($AA$30:AA34)<0.01,0.01,STDEV($AA$30:AA34)))*SQRT(COUNT($AA$30:AA34))/(2*(COUNT($AA$30:AA34)-1)))))))","v":{"$error":"#DIV/0!"}},{"$f":"IF((MAX(0,(0.5-(($AT$21-AVERAGE($AB$30:AB34))/(IF(STDEV($AB$30:AB34)<0.01,0.01,STDEV($AB$30:AB34)))*SQRT(COUNT($AB$30:AB34))/(2*(COUNT($AB$30:AB34)-1))))))>1,1,(MAX(0,(0.5-(($AT$21-AVERAGE($AB$30:AB34))/(IF(STDEV($AB$30:AB34)<0.01,0.01,STDEV($AB$30:AB34)))*SQRT(COUNT($AB$30:AB34))/(2*(COUNT($AB$30:AB34)-1)))))))","v":{"$error":"#DIV/0!"}},null,null,{"$f":"IF((MAX(0,(0.5-((AVERAGE($N$30:N34)-$AW$22)/(IF(STDEV($N$30:N34)<0.01,0.01,STDEV($N$30:N34)))*SQRT(COUNT($N$30:N34))/(2*(COUNT($N$30:N34)-1))))))>1,1,(MAX(0,(0.5-((AVERAGE($N$30:N34)-$AW$22)/(IF(STDEV($N$30:N34)<0.01,0.01,STDEV($N$30:N34)))*SQRT(COUNT($N$30:N34))/(2*(COUNT($N$30:N34)-1)))))))","v":{"$error":"#DIV/0!"}},{"$f":"IF((MAX(0,(0.5-((AVERAGE($S$30:S34)-$AX$22)/(IF(STDEV($S$30:S34)<0.01,0.01,STDEV($S$30:S34)))*SQRT(COUNT($S$30:S34))/(2*(COUNT($S$30:S34)-1))))))>1,1,(MAX(0,(0.5-((AVERAGE($S$30:S34)-$AX$22)/(IF(STDEV($S$30:S34)<0.01,0.01,STDEV($S$30:S34)))*SQRT(COUNT($S$30:S34))/(2*(COUNT($S$30:S34)-1)))))))","v":{"$error":"#DIV/0!"}},{"$f":"IF((MAX(0,(0.5-((AVERAGE($T$30:T34)-$AY$22)/(IF(STDEV($T$30:T34)<0.01,0.01,STDEV($T$30:T34)))*SQRT(COUNT($T$30:T34))/(2*(COUNT($T$30:T34)-1))))))>1,1,(MAX(0,(0.5-((AVERAGE($T$30:T34)-$AY$22)/(IF(STDEV($T$30:T34)<0.01,0.01,STDEV($T$30:T34)))*SQRT(COUNT($T$30:T34))/(2*(COUNT($T$30:T34)-1)))))))","v":{"$error":"#DIV/0!"}},{"$f":"IF((MAX(0,(0.5-((AVERAGE($AA$30:AA34)-$AZ$22)/(IF(STDEV($AA$30:AA34)<0.01,0.01,STDEV($AA$30:AA34)))*SQRT(COUNT($AA$30:AA34))/(2*(COUNT($AA$30:AA34)-1))))))>1,1,(MAX(0,(0.5-((AVERAGE($AA$30:AA34)-$AZ$22)/(IF(STDEV($AA$30:AA34)<0.01,0.01,STDEV($AA$30:AA34)))*SQRT(COUNT($AA$30:AA34))/(2*(COUNT($AA$30:AA34)-1)))))))","v":{"$error":"#DIV/0!"}},{"$f":"IF((MAX(0,(0.5-((AVERAGE($AB$30:AB34)-$BA$22)/(IF(STDEV($AB$30:AB34)<0.01,0.01,STDEV($AB$30:AB34)))*SQRT(COUNT($AB$30:AB34))/(2*(COUNT($AB$30:AB34)-1))))))>1,1,(MAX(0,(0.5-((AVERAGE($AB$30:AB34)-$BA$22)/(IF(STDEV($AB$30:AB34)<0.01,0.01,STDEV($AB$30:AB34)))*SQRT(COUNT($AB$30:AB34))/(2*(COUNT($AB$30:AB34)-1)))))))","v":{"$error":"#DIV/0!"}},null,null,null,{"$f":"(0.5 * ((100-(BETADIST(AL34,((COUNT(N$30:N34))/2)-1,((COUNT(N$30:N34))/2)-1))*100) + (100-(BETADIST(AW34,((COUNT(N$30:N34))/2)-1,((COUNT(N$30:N34))/2)-1))*100) - 100) + 55) / 100","v":{"$error":"#VALUE!"}},{"$f":"(0.5 * ((100-(BETADIST(AQ34,((COUNT(S$30:S34))/2)-1,((COUNT(S$30:S34))/2)-1))*100) + (100-(BETADIST(AX34,((COUNT(S$30:S34))/2)-1,((COUNT(S$30:S34))/2)-1))*100) - 100) + 55) / 100","v":{"$error":"#VALUE!"}},{"$f":"(0.5 * ((100-(BETADIST(AR34,((COUNT(T$30:T34))/2)-1,((COUNT(T$30:T34))/2)-1))*100) + (100-(BETADIST(AY34,((COUNT(T$30:T34))/2)-1,((COUNT(T$30:T34))/2)-1))*100) - 100) + 55) / 100","v":{"$error":"#VALUE!"}},{"$f":"(0.5 * ((100-(BETADIST(AS34,((COUNT(AA$30:AA34))/2)-1,((COUNT(AA$30:AA34))/2)-1))*100) + (100-(BETADIST(AZ34,((COUNT(AA$30:AA34))/2)-1,((COUNT(AA$30:AA34))/2)-1))*100) - 100) + 55) / 100","v":{"$error":"#DIV/0!"}},{"$f":"(0.5 * ((100-(BETADIST(AT34,((COUNT(AB$30:AB34))/2)-1,((COUNT(AB$30:AB34))/2)-1))*100) + (100-(BETADIST(BA34,((COUNT(AB$30:AB34))/2)-1,((COUNT(AB$30:AB34))/2)-1))*100) - 100) + 55) / 100","v":{"$error":"#DIV/0!"}},{"$error":"#VALUE!"}]
[null,null,null,null,null,null,null,null,null,null,null,null,null,null,null,null,null,null,null,null,null,null,null,null,null,null,"","",null,null,0,0,0,0,0,0,0,{"$f":"IF((MAX(0,(0.5-(($AL$21-AVERAGE($N$30:N35))/(IF(STDEV($N$30:N35)<0.01,0.01,STDEV($N$30:N35)))*SQRT(COUNT($N$30:N35))/(2*(COUNT($N$30:N35)-1))))))>1,1,(MAX(0,(0.5-(($AL$21-AVERAGE($N$30:N35))/(IF(STDEV($N$30:N35)<0.01,0.01,STDEV($N$30:N35)))*SQRT(COUNT($N$30:N35))/(2*(COUNT($N$30:N35)-1)))))))","v":{"$error":"#VALUE!"}},0,0,0,0,{"$f":"IF((MAX(0,(0.5-(($AQ$21-AVERAGE($S$30:S35))/(IF(STDEV($S$30:S35)<0.01,0.01,STDEV($S$30:S35)))*SQRT(COUNT($S$30:S35))/(2*(COUNT($S$30:S35)-1))))))>1,1,(MAX(0,(0.5-(($AQ$21-AVERAGE($S$30:S35))/(IF(STDEV($S$30:S35)<0.01,0.01,STDEV($S$30:S35)))*SQRT(COUNT($S$30:S35))/(2*(COUNT($S$30:S35)-1)))))))","v":{"$error":"#VALUE!"}},{"$f":"IF((MAX(0,(0.5-(($AR$21-AVERAGE($T$30:T35))/(IF(STDEV($T$30:T35)<0.01,0.01,STDEV($T$30:T35)))*SQRT(COUNT($T$30:T35))/(2*(COUNT($T$30:T35)-1))))))>1,1,(MAX(0,(0.5-(($AR$21-AVERAGE($T$30:T35))/(IF(STDEV($T$30:T35)<0.01,0.01,STDEV($T$30:T35)))*SQRT(COUNT($T$30:T35))/(2*(COUNT($T$30:T35)-1)))))))","v":{"$error":"#VALUE!"}},{"$f":"IF((MAX(0,(0.5-(($AS$21-AVERAGE($AA$30:AA35))/(IF(STDEV($AA$30:AA35)<0.01,0.01,STDEV($AA$30:AA35)))*SQRT(COUNT($AA$30:AA35))/(2*(COUNT($AA$30:AA35)-1))))))>1,1,(MAX(0,(0.5-(($AS$21-AVERAGE($AA$30:AA35))/(IF(STDEV($AA$30:AA35)<0.01,0.01,STDEV($AA$30:AA35)))*SQRT(COUNT($AA$30:AA35))/(2*(COUNT($AA$30:AA35)-1)))))))","v":{"$error":"#DIV/0!"}},{"$f":"IF((MAX(0,(0.5-(($AT$21-AVERAGE($AB$30:AB35))/(IF(STDEV($AB$30:AB35)<0.01,0.01,STDEV($AB$30:AB35)))*SQRT(COUNT($AB$30:AB35))/(2*(COUNT($AB$30:AB35)-1))))))>1,1,(MAX(0,(0.5-(($AT$21-AVERAGE($AB$30:AB35))/(IF(STDEV($AB$30:AB35)<0.01,0.01,STDEV($AB$30:AB35)))*SQRT(COUNT($AB$30:AB35))/(2*(COUNT($AB$30:AB35)-1)))))))","v":{"$error":"#DIV/0!"}},null,null,{"$f":"IF((MAX(0,(0.5-((AVERAGE($N$30:N35)-$AW$22)/(IF(STDEV($N$30:N35)<0.01,0.01,STDEV($N$30:N35)))*SQRT(COUNT($N$30:N35))/(2*(COUNT($N$30:N35)-1))))))>1,1,(MAX(0,(0.5-((AVERAGE($N$30:N35)-$AW$22)/(IF(STDEV($N$30:N35)<0.01,0.01,STDEV($N$30:N35)))*SQRT(COUNT($N$30:N35))/(2*(COUNT($N$30:N35)-1)))))))","v":{"$error":"#DIV/0!"}},{"$f":"IF((MAX(0,(0.5-((AVERAGE($S$30:S35)-$AX$22)/(IF(STDEV($S$30:S35)<0.01,0.01,STDEV($S$30:S35)))*SQRT(COUNT($S$30:S35))/(2*(COUNT($S$30:S35)-1))))))>1,1,(MAX(0,(0.5-((AVERAGE($S$30:S35)-$AX$22)/(IF(STDEV($S$30:S35)<0.01,0.01,STDEV($S$30:S35)))*SQRT(COUNT($S$30:S35))/(2*(COUNT($S$30:S35)-1)))))))","v":{"$error":"#DIV/0!"}},{"$f":"IF((MAX(0,(0.5-((AVERAGE($T$30:T35)-$AY$22)/(IF(STDEV($T$30:T35)<0.01,0.01,STDEV($T$30:T35)))*SQRT(COUNT($T$30:T35))/(2*(COUNT($T$30:T35)-1))))))>1,1,(MAX(0,(0.5-((AVERAGE($T$30:T35)-$AY$22)/(IF(STDEV($T$30:T35)<0.01,0.01,STDEV($T$30:T35)))*SQRT(COUNT($T$30:T35))/(2*(COUNT($T$30:T35)-1)))))))","v":{"$error":"#DIV/0!"}},{"$f":"IF((MAX(0,(0.5-((AVERAGE($AA$30:AA35)-$AZ$22)/(IF(STDEV($AA$30:AA35)<0.01,0.01,STDEV($AA$30:AA35)))*SQRT(COUNT($AA$30:AA35))/(2*(COUNT($AA$30:AA35)-1))))))>1,1,(MAX(0,(0.5-((AVERAGE($AA$30:AA35)-$AZ$22)/(IF(STDEV($AA$30:AA35)<0.01,0.01,STDEV($AA$30:AA35)))*SQRT(COUNT($AA$30:AA35))/(2*(COUNT($AA$30:AA35)-1)))))))","v":{"$error":"#DIV/0!"}},{"$f":"IF((MAX(0,(0.5-((AVERAGE($AB$30:AB35)-$BA$22)/(IF(STDEV($AB$30:AB35)<0.01,0.01,STDEV($AB$30:AB35)))*SQRT(COUNT($AB$30:AB35))/(2*(COUNT($AB$30:AB35)-1))))))>1,1,(MAX(0,(0.5-((AVERAGE($AB$30:AB35)-$BA$22)/(IF(STDEV($AB$30:AB35)<0.01,0.01,STDEV($AB$30:AB35)))*SQRT(COUNT($AB$30:AB35))/(2*(COUNT($AB$30:AB35)-1)))))))","v":{"$error":"#DIV/0!"}},null,null,null,{"$f":"(0.5 * ((100-(BETADIST(AL35,((COUNT(N$30:N35))/2)-1,((COUNT(N$30:N35))/2)-1))*100) + (100-(BETADIST(AW35,((COUNT(N$30:N35))/2)-1,((COUNT(N$30:N35))/2)-1))*100) - 100) + 55) / 100","v":{"$error":"#VALUE!"}},{"$f":"(0.5 * ((100-(BETADIST(AQ35,((COUNT(S$30:S35))/2)-1,((COUNT(S$30:S35))/2)-1))*100) + (100-(BETADIST(AX35,((COUNT(S$30:S35))/2)-1,((COUNT(S$30:S35))/2)-1))*100) - 100) + 55) / 100","v":{"$error":"#VALUE!"}},{"$f":"(0.5 * ((100-(BETADIST(AR35,((COUNT(T$30:T35))/2)-1,((COUNT(T$30:T35))/2)-1))*100) + (100-(BETADIST(AY35,((COUNT(T$30:T35))/2)-1,((COUNT(T$30:T35))/2)-1))*100) - 100) + 55) / 100","v":{"$error":"#VALUE!"}},{"$f":"(0.5 * ((100-(BETADIST(AS35,((COUNT(AA$30:AA35))/2)-1,((COUNT(AA$30:AA35))/2)-1))*100) + (100-(BETADIST(AZ35,((COUNT(AA$30:AA35))/2)-1,((COUNT(AA$30:AA35))/2)-1))*100) - 100) + 55) / 100","v":{"$error":"#DIV/0!"}},{"$f":"(0.5 * ((100-(BETADIST(AT35,((COUNT(AB$30:AB35))/2)-1,((COUNT(AB$30:AB35))/2)-1))*100) + (100-(BETADIST(BA35,((COUNT(AB$30:AB35))/2)-1,((COUNT(AB$30:AB35))/2)-1))*100) - 100) + 55) / 100","v":{"$error":"#DIV/0!"}},{"$error":"#VALUE!"}]
[null,null,null,null,null,null,null,null,null,null,null,null,null,null,null,null,null,null,null,null,null,null,null,null,null,null,"","",null,null,0,0,0,0,0,0,0,{"$f":"IF((MAX(0,(0.5-(($AL$21-AVERAGE($N$30:N36))/(IF(STDEV($N$30:N36)<0.01,0.01,STDEV($N$30:N36)))*SQRT(COUNT($N$30:N36))/(2*(COUNT($N$30:N36)-1))))))>1,1,(MAX(0,(0.5-(($AL$21-AVERAGE($N$30:N36))/(IF(STDEV($N$30:N36)<0.01,0.01,STDEV($N$30:N36)))*SQRT(COUNT($N$30:N36))/(2*(COUNT($N$30:N36)-1)))))))","v":{"$error":"#VALUE!"}},0,0,0,0,{"$f":"IF((MAX(0,(0.5-(($AQ$21-AVERAGE($S$30:S36))/(IF(STDEV($S$30:S36)<0.01,0.01,STDEV($S$30:S36)))*SQRT(COUNT($S$30:S36))/(2*(COUNT($S$30:S36)-1))))))>1,1,(MAX(0,(0.5-(($AQ$21-AVERAGE($S$30:S36))/(IF(STDEV($S$30:S36)<0.01,0.01,STDEV($S$30:S36)))*SQRT(COUNT($S$30:S36))/(2*(COUNT($S$30:S36)-1)))))))","v":{"$error":"#VALUE!"}},{"$f":"IF((MAX(0,(0.5-(($AR$21-AVERAGE($T$30:T36))/(IF(STDEV($T$30:T36)<0.01,0.01,STDEV($T$30:T36)))*SQRT(COUNT($T$30:T36))/(2*(COUNT($T$30:T36)-1))))))>1,1,(MAX(0,(0.5-(($AR$21-AVERAGE($T$30:T36))/(IF(STDEV($T$30:T36)<0.01,0.01,STDEV($T$30:T36)))*SQRT(COUNT($T$30:T36))/(2*(COUNT($T$30:T36)-1)))))))","v":{"$error":"#VALUE!"}},{"$f":"IF((MAX(0,(0.5-(($AS$21-AVERAGE($AA$30:AA36))/(IF(STDEV($AA$30:AA36)<0.01,0.01,STDEV($AA$30:AA36)))*SQRT(COUNT($AA$30:AA36))/(2*(COUNT($AA$30:AA36)-1))))))>1,1,(MAX(0,(0.5-(($AS$21-AVERAGE($AA$30:AA36))/(IF(STDEV($AA$30:AA36)<0.01,0.01,STDEV($AA$30:AA36)))*SQRT(COUNT($AA$30:AA36))/(2*(COUNT($AA$30:AA36)-1)))))))","v":{"$error":"#DIV/0!"}},{"$f":"IF((MAX(0,(0.5-(($AT$21-AVERAGE($AB$30:AB36))/(IF(STDEV($AB$30:AB36)<0.01,0.01,STDEV($AB$30:AB36)))*SQRT(COUNT($AB$30:AB36))/(2*(COUNT($AB$30:AB36)-1))))))>1,1,(MAX(0,(0.5-(($AT$21-AVERAGE($AB$30:AB36))/(IF(STDEV($AB$30:AB36)<0.01,0.01,STDEV($AB$30:AB36)))*SQRT(COUNT($AB$30:AB36))/(2*(COUNT($AB$30:AB36)-1)))))))","v":{"$error":"#DIV/0!"}},null,null,{"$f":"IF((MAX(0,(0.5-((AVERAGE($N$30:N36)-$AW$22)/(IF(STDEV($N$30:N36)<0.01,0.01,STDEV($N$30:N36)))*SQRT(COUNT($N$30:N36))/(2*(COUNT($N$30:N36)-1))))))>1,1,(MAX(0,(0.5-((AVERAGE($N$30:N36)-$AW$22)/(IF(STDEV($N$30:N36)<0.01,0.01,STDEV($N$30:N36)))*SQRT(COUNT($N$30:N36))/(2*(COUNT($N$30:N36)-1)))))))","v":{"$error":"#DIV/0!"}},{"$f":"IF((MAX(0,(0.5-((AVERAGE($S$30:S36)-$AX$22)/(IF(STDEV($S$30:S36)<0.01,0.01,STDEV($S$30:S36)))*SQRT(COUNT($S$30:S36))/(2*(COUNT($S$30:S36)-1))))))>1,1,(MAX(0,(0.5-((AVERAGE($S$30:S36)-$AX$22)/(IF(STDEV($S$30:S36)<0.01,0.01,STDEV($S$30:S36)))*SQRT(COUNT($S$30:S36))/(2*(COUNT($S$30:S36)-1)))))))","v":{"$error":"#DIV/0!"}},{"$f":"IF((MAX(0,(0.5-((AVERAGE($T$30:T36)-$AY$22)/(IF(STDEV($T$30:T36)<0.01,0.01,STDEV($T$30:T36)))*SQRT(COUNT($T$30:T36))/(2*(COUNT($T$30:T36)-1))))))>1,1,(MAX(0,(0.5-((AVERAGE($T$30:T36)-$AY$22)/(IF(STDEV($T$30:T36)<0.01,0.01,STDEV($T$30:T36)))*SQRT(COUNT($T$30:T36))/(2*(COUNT($T$30:T36)-1)))))))","v":{"$error":"#DIV/0!"}},{"$f":"IF((MAX(0,(0.5-((AVERAGE($AA$30:AA36)-$AZ$22)/(IF(STDEV($AA$30:AA36)<0.01,0.01,STDEV($AA$30:AA36)))*SQRT(COUNT($AA$30:AA36))/(2*(COUNT($AA$30:AA36)-1))))))>1,1,(MAX(0,(0.5-((AVERAGE($AA$30:AA36)-$AZ$22)/(IF(STDEV($AA$30:AA36)<0.01,0.01,STDEV($AA$30:AA36)))*SQRT(COUNT($AA$30:AA36))/(2*(COUNT($AA$30:AA36)-1)))))))","v":{"$error":"#DIV/0!"}},{"$f":"IF((MAX(0,(0.5-((AVERAGE($AB$30:AB36)-$BA$22)/(IF(STDEV($AB$30:AB36)<0.01,0.01,STDEV($AB$30:AB36)))*SQRT(COUNT($AB$30:AB36))/(2*(COUNT($AB$30:AB36)-1))))))>1,1,(MAX(0,(0.5-((AVERAGE($AB$30:AB36)-$BA$22)/(IF(STDEV($AB$30:AB36)<0.01,0.01,STDEV($AB$30:AB36)))*SQRT(COUNT($AB$30:AB36))/(2*(COUNT($AB$30:AB36)-1)))))))","v":{"$error":"#DIV/0!"}},null,null,null,{"$f":"(0.5 * ((100-(BETADIST(AL36,((COUNT(N$30:N36))/2)-1,((COUNT(N$30:N36))/2)-1))*100) + (100-(BETADIST(AW36,((COUNT(N$30:N36))/2)-1,((COUNT(N$30:N36))/2)-1))*100) - 100) + 55) / 100","v":{"$error":"#VALUE!"}},{"$f":"(0.5 * ((100-(BETADIST(AQ36,((COUNT(S$30:S36))/2)-1,((COUNT(S$30:S36))/2)-1))*100) + (100-(BETADIST(AX36,((COUNT(S$30:S36))/2)-1,((COUNT(S$30:S36))/2)-1))*100) - 100) + 55) / 100","v":{"$error":"#VALUE!"}},{"$f":"(0.5 * ((100-(BETADIST(AR36,((COUNT(T$30:T36))/2)-1,((COUNT(T$30:T36))/2)-1))*100) + (100-(BETADIST(AY36,((COUNT(T$30:T36))/2)-1,((COUNT(T$30:T36))/2)-1))*100) - 100) + 55) / 100","v":{"$error":"#VALUE!"}},{"$f":"(0.5 * ((100-(BETADIST(AS36,((COUNT(AA$30:AA36))/2)-1,((COUNT(AA$30:AA36))/2)-1))*100) + (100-(BETADIST(AZ36,((COUNT(AA$30:AA36))/2)-1,((COUNT(AA$30:AA36))/2)-1))*100) - 100) + 55) / 100","v":{"$error":"#DIV/0!"}},{"$f":"(0.5 * ((100-(BETADIST(AT36,((COUNT(AB$30:AB36))/2)-1,((COUNT(AB$30:AB36))/2)-1))*100) + (100-(BETADIST(BA36,((COUNT(AB$30:AB36))/2)-1,((COUNT(AB$30:AB36))/2)-1))*100) - 100) + 55) / 100","v":{"$error":"#DIV/0!"}},{"$error":"#VALUE!"}]
[null,null,null,null,null,null,null,null,null,null,null,null,null,null,null,null,null,null,null,null,null,null,null,null,null,null,"","",null,null,0,0,0,0,0,0,0,{"$f":"IF((MAX(0,(0.5-(($AL$21-AVERAGE($N$30:N37))/(IF(STDEV($N$30:N37)<0.01,0.01,STDEV($N$30:N37)))*SQRT(COUNT($N$30:N37))/(2*(COUNT($N$30:N37)-1))))))>1,1,(MAX(0,(0.5-(($AL$21-AVERAGE($N$30:N37))/(IF(STDEV($N$30:N37)<0.01,0.01,STDEV($N$30:N37)))*SQRT(COUNT($N$30:N37))/(2*(COUNT($N$30:N37)-1)))))))","v":{"$error":"#VALUE!"}},0,0,0,0,{"$f":"IF((MAX(0,(0.5-(($AQ$21-AVERAGE($S$30:S37))/(IF(STDEV($S$30:S37)<0.01,0.01,STDEV($S$30:S37)))*SQRT(COUNT($S$30:S37))/(2*(COUNT($S$30:S37)-1))))))>1,1,(MAX(0,(0.5-(($AQ$21-AVERAGE($S$30:S37))/(IF(STDEV($S$30:S37)<0.01,0.01,STDEV($S$30:S37)))*SQRT(COUNT($S$30:S37))/(2*(COUNT($S$30:S37)-1)))))))","v":{"$error":"#VALUE!"}},{"$f":"IF((MAX(0,(0.5-(($AR$21-AVERAGE($T$30:T37))/(IF(STDEV($T$30:T37)<0.01,0.01,STDEV($T$30:T37)))*SQRT(COUNT($T$30:T37))/(2*(COUNT($T$30:T37)-1))))))>1,1,(MAX(0,(0.5-(($AR$21-AVERAGE($T$30:T37))/(IF(STDEV($T$30:T37)<0.01,0.01,STDEV($T$30:T37)))*SQRT(COUNT($T$30:T37))/(2*(COUNT($T$30:T37)-1)))))))","v":{"$error":"#VALUE!"}},{"$f":"IF((MAX(0,(0.5-(($AS$21-AVERAGE($AA$30:AA37))/(IF(STDEV($AA$30:AA37)<0.01,0.01,STDEV($AA$30:AA37)))*SQRT(COUNT($AA$30:AA37))/(2*(COUNT($AA$30:AA37)-1))))))>1,1,(MAX(0,(0.5-(($AS$21-AVERAGE($AA$30:AA37))/(IF(STDEV($AA$30:AA37)<0.01,0.01,STDEV($AA$30:AA37)))*SQRT(COUNT($AA$30:AA37))/(2*(COUNT($AA$30:AA37)-1)))))))","v":{"$error":"#DIV/0!"}},{"$f":"IF((MAX(0,(0.5-(($AT$21-AVERAGE($AB$30:AB37))/(IF(STDEV($AB$30:AB37)<0.01,0.01,STDEV($AB$30:AB37)))*SQRT(COUNT($AB$30:AB37))/(2*(COUNT($AB$30:AB37)-1))))))>1,1,(MAX(0,(0.5-(($AT$21-AVERAGE($AB$30:AB37))/(IF(STDEV($AB$30:AB37)<0.01,0.01,STDEV($AB$30:AB37)))*SQRT(COUNT($AB$30:AB37))/(2*(COUNT($AB$30:AB37)-1)))))))","v":{"$error":"#DIV/0!"}},null,null,{"$f":"IF((MAX(0,(0.5-((AVERAGE($N$30:N37)-$AW$22)/(IF(STDEV($N$30:N37)<0.01,0.01,STDEV($N$30:N37)))*SQRT(COUNT($N$30:N37))/(2*(COUNT($N$30:N37)-1))))))>1,1,(MAX(0,(0.5-((AVERAGE($N$30:N37)-$AW$22)/(IF(STDEV($N$30:N37)<0.01,0.01,STDEV($N$30:N37)))*SQRT(COUNT($N$30:N37))/(2*(COUNT($N$30:N37)-1)))))))","v":{"$error":"#DIV/0!"}},{"$f":"IF((MAX(0,(0.5-((AVERAGE($S$30:S37)-$AX$22)/(IF(STDEV($S$30:S37)<0.01,0.01,STDEV($S$30:S37)))*SQRT(COUNT($S$30:S37))/(2*(COUNT($S$30:S37)-1))))))>1,1,(MAX(0,(0.5-((AVERAGE($S$30:S37)-$AX$22)/(IF(STDEV($S$30:S37)<0.01,0.01,STDEV($S$30:S37)))*SQRT(COUNT($S$30:S37))/(2*(COUNT($S$30:S37)-1)))))))","v":{"$error":"#DIV/0!"}},{"$f":"IF((MAX(0,(0.5-((AVERAGE($T$30:T37)-$AY$22)/(IF(STDEV($T$30:T37)<0.01,0.01,STDEV($T$30:T37)))*SQRT(COUNT($T$30:T37))/(2*(COUNT($T$30:T37)-1))))))>1,1,(MAX(0,(0.5-((AVERAGE($T$30:T37)-$AY$22)/(IF(STDEV($T$30:T37)<0.01,0.01,STDEV($T$30:T37)))*SQRT(COUNT($T$30:T37))/(2*(COUNT($T$30:T37)-1)))))))","v":{"$error":"#DIV/0!"}},{"$f":"IF((MAX(0,(0.5-((AVERAGE($AA$30:AA37)-$AZ$22)/(IF(STDEV($AA$30:AA37)<0.01,0.01,STDEV($AA$30:AA37)))*SQRT(COUNT($AA$30:AA37))/(2*(COUNT($AA$30:AA37)-1))))))>1,1,(MAX(0,(0.5-((AVERAGE($AA$30:AA37)-$AZ$22)/(IF(STDEV($AA$30:AA37)<0.01,0.01,STDEV($AA$30:AA37)))*SQRT(COUNT($AA$30:AA37))/(2*(COUNT($AA$30:AA37)-1)))))))","v":{"$error":"#DIV/0!"}},{"$f":"IF((MAX(0,(0.5-((AVERAGE($AB$30:AB37)-$BA$22)/(IF(STDEV($AB$30:AB37)<0.01,0.01,STDEV($AB$30:AB37)))*SQRT(COUNT($AB$30:AB37))/(2*(COUNT($AB$30:AB37)-1))))))>1,1,(MAX(0,(0.5-((AVERAGE($AB$30:AB37)-$BA$22)/(IF(STDEV($AB$30:AB37)<0.01,0.01,STDEV($AB$30:AB37)))*SQRT(COUNT($AB$30:AB37))/(2*(COUNT($AB$30:AB37)-1)))))))","v":{"$error":"#DIV/0!"}},null,null,null,{"$f":"(0.5 * ((100-(BETADIST(AL37,((COUNT(N$30:N37))/2)-1,((COUNT(N$30:N37))/2)-1))*100) + (100-(BETADIST(AW37,((COUNT(N$30:N37))/2)-1,((COUNT(N$30:N37))/2)-1))*100) - 100) + 55) / 100","v":{"$error":"#VALUE!"}},{"$f":"(0.5 * ((100-(BETADIST(AQ37,((COUNT(S$30:S37))/2)-1,((COUNT(S$30:S37))/2)-1))*100) + (100-(BETADIST(AX37,((COUNT(S$30:S37))/2)-1,((COUNT(S$30:S37))/2)-1))*100) - 100) + 55) / 100","v":{"$error":"#VALUE!"}},{"$f":"(0.5 * ((100-(BETADIST(AR37,((COUNT(T$30:T37))/2)-1,((COUNT(T$30:T37))/2)-1))*100) + (100-(BETADIST(AY37,((COUNT(T$30:T37))/2)-1,((COUNT(T$30:T37))/2)-1))*100) - 100) + 55) / 100","v":{"$error":"#VALUE!"}},{"$f":"(0.5 * ((100-(BETADIST(AS37,((COUNT(AA$30:AA37))/2)-1,((COUNT(AA$30:AA37))/2)-1))*100) + (100-(BETADIST(AZ37,((COUNT(AA$30:AA37))/2)-1,((COUNT(AA$30:AA37))/2)-1))*100) - 100) + 55) / 100","v":{"$error":"#DIV/0!"}},{"$f":"(0.5 * ((100-(BETADIST(AT37,((COUNT(AB$30:AB37))/2)-1,((COUNT(AB$30:AB37))/2)-1))*100) + (100-(BETADIST(BA37,((COUNT(AB$30:AB37))/2)-1,((COUNT(AB$30:AB37))/2)-1))*100) - 100) + 55) / 100","v":{"$error":"#DIV/0!"}},{"$error":"#VALUE!"}]
[null,null,null,null,null,null,null,null,null,null,null,null,null,null,null,null,null,null,null,null,null,null,null,null,null,null,"","",null,null,0,0,0,0,0,0,0,{"$f":"IF((MAX(0,(0.5-(($AL$21-AVERAGE($N$30:N38))/(IF(STDEV($N$30:N38)<0.01,0.01,STDEV($N$30:N38)))*SQRT(COUNT($N$30:N38))/(2*(COUNT($N$30:N38)-1))))))>1,1,(MAX(0,(0.5-(($AL$21-AVERAGE($N$30:N38))/(IF(STDEV($N$30:N38)<0.01,0.01,STDEV($N$30:N38)))*SQRT(COUNT($N$30:N38))/(2*(COUNT($N$30:N38)-1)))))))","v":{"$error":"#VALUE!"}},0,0,0,0,{"$f":"IF((MAX(0,(0.5-(($AQ$21-AVERAGE($S$30:S38))/(IF(STDEV($S$30:S38)<0.01,0.01,STDEV($S$30:S38)))*SQRT(COUNT($S$30:S38))/(2*(COUNT($S$30:S38)-1))))))>1,1,(MAX(0,(0.5-(($AQ$21-AVERAGE($S$30:S38))/(IF(STDEV($S$30:S38)<0.01,0.01,STDEV($S$30:S38)))*SQRT(COUNT($S$30:S38))/(2*(COUNT($S$30:S38)-1)))))))","v":{"$error":"#VALUE!"}},{"$f":"IF((MAX(0,(0.5-(($AR$21-AVERAGE($T$30:T38))/(IF(STDEV($T$30:T38)<0.01,0.01,STDEV($T$30:T38)))*SQRT(COUNT($T$30:T38))/(2*(COUNT($T$30:T38)-1))))))>1,1,(MAX(0,(0.5-(($AR$21-AVERAGE($T$30:T38))/(IF(STDEV($T$30:T38)<0.01,0.01,STDEV($T$30:T38)))*SQRT(COUNT($T$30:T38))/(2*(COUNT($T$30:T38)-1)))))))","v":{"$error":"#VALUE!"}},{"$f":"IF((MAX(0,(0.5-(($AS$21-AVERAGE($AA$30:AA38))/(IF(STDEV($AA$30:AA38)<0.01,0.01,STDEV($AA$30:AA38)))*SQRT(COUNT($AA$30:AA38))/(2*(COUNT($AA$30:AA38)-1))))))>1,1,(MAX(0,(0.5-(($AS$21-AVERAGE($AA$30:AA38))/(IF(STDEV($AA$30:AA38)<0.01,0.01,STDEV($AA$30:AA38)))*SQRT(COUNT($AA$30:AA38))/(2*(COUNT($AA$30:AA38)-1)))))))","v":{"$error":"#DIV/0!"}},{"$f":"IF((MAX(0,(0.5-(($AT$21-AVERAGE($AB$30:AB38))/(IF(STDEV($AB$30:AB38)<0.01,0.01,STDEV($AB$30:AB38)))*SQRT(COUNT($AB$30:AB38))/(2*(COUNT($AB$30:AB38)-1))))))>1,1,(MAX(0,(0.5-(($AT$21-AVERAGE($AB$30:AB38))/(IF(STDEV($AB$30:AB38)<0.01,0.01,STDEV($AB$30:AB38)))*SQRT(COUNT($AB$30:AB38))/(2*(COUNT($AB$30:AB38)-1)))))))","v":{"$error":"#DIV/0!"}},null,null,{"$f":"IF((MAX(0,(0.5-((AVERAGE($N$30:N38)-$AW$22)/(IF(STDEV($N$30:N38)<0.01,0.01,STDEV($N$30:N38)))*SQRT(COUNT($N$30:N38))/(2*(COUNT($N$30:N38)-1))))))>1,1,(MAX(0,(0.5-((AVERAGE($N$30:N38)-$AW$22)/(IF(STDEV($N$30:N38)<0.01,0.01,STDEV($N$30:N38)))*SQRT(COUNT($N$30:N38))/(2*(COUNT($N$30:N38)-1)))))))","v":{"$error":"#DIV/0!"}},{"$f":"IF((MAX(0,(0.5-((AVERAGE($S$30:S38)-$AX$22)/(IF(STDEV($S$30:S38)<0.01,0.01,STDEV($S$30:S38)))*SQRT(COUNT($S$30:S38))/(2*(COUNT($S$30:S38)-1))))))>1,1,(MAX(0,(0.5-((AVERAGE($S$30:S38)-$AX$22)/(IF(STDEV($S$30:S38)<0.01,0.01,STDEV($S$30:S38)))*SQRT(COUNT($S$30:S38))/(2*(COUNT($S$30:S38)-1)))))))","v":{"$error":"#DIV/0!"}},{"$f":"IF((MAX(0,(0.5-((AVERAGE($T$30:T38)-$AY$22)/(IF(STDEV($T$30:T38)<0.01,0.01,STDEV($T$30:T38)))*SQRT(COUNT($T$30:T38))/(2*(COUNT($T$30:T38)-1))))))>1,1,(MAX(0,(0.5-((AVERAGE($T$30:T38)-$AY$22)/(IF(STDEV($T$30:T38)<0.01,0.01,STDEV($T$30:T38)))*SQRT(COUNT($T$30:T38))/(2*(COUNT($T$30:T38)-1)))))))","v":{"$error":"#DIV/0!"}},{"$f":"IF((MAX(0,(0.5-((AVERAGE($AA$30:AA38)-$AZ$22)/(IF(STDEV($AA$30:AA38)<0.01,0.01,STDEV($AA$30:AA38)))*SQRT(COUNT($AA$30:AA38))/(2*(COUNT($AA$30:AA38)-1))))))>1,1,(MAX(0,(0.5-((AVERAGE($AA$30:AA38)-$AZ$22)/(IF(STDEV($AA$30:AA38)<0.01,0.01,STDEV($AA$30:AA38)))*SQRT(COUNT($AA$30:AA38))/(2*(COUNT($AA$30:AA38)-1)))))))","v":{"$error":"#DIV/0!"}},{"$f":"IF((MAX(0,(0.5-((AVERAGE($AB$30:AB38)-$BA$22)/(IF(STDEV($AB$30:AB38)<0.01,0.01,STDEV($AB$30:AB38)))*SQRT(COUNT($AB$30:AB38))/(2*(COUNT($AB$30:AB38)-1))))))>1,1,(MAX(0,(0.5-((AVERAGE($AB$30:AB38)-$BA$22)/(IF(STDEV($AB$30:AB38)<0.01,0.01,STDEV($AB$30:AB38)))*SQRT(COUNT($AB$30:AB38))/(2*(COUNT($AB$30:AB38)-1)))))))","v":{"$error":"#DIV/0!"}},null,null,null,{"$f":"(0.5 * ((100-(BETADIST(AL38,((COUNT(N$30:N38))/2)-1,((COUNT(N$30:N38))/2)-1))*100) + (100-(BETADIST(AW38,((COUNT(N$30:N38))/2)-1,((COUNT(N$30:N38))/2)-1))*100) - 100) + 55) / 100","v":{"$error":"#VALUE!"}},{"$f":"(0.5 * ((100-(BETADIST(AQ38,((COUNT(S$30:S38))/2)-1,((COUNT(S$30:S38))/2)-1))*100) + (100-(BETADIST(AX38,((COUNT(S$30:S38))/2)-1,((COUNT(S$30:S38))/2)-1))*100) - 100) + 55) / 100","v":{"$error":"#VALUE!"}},{"$f":"(0.5 * ((100-(BETADIST(AR38,((COUNT(T$30:T38))/2)-1,((COUNT(T$30:T38))/2)-1))*100) + (100-(BETADIST(AY38,((COUNT(T$30:T38))/2)-1,((COUNT(T$30:T38))/2)-1))*100) - 100) + 55) / 100","v":{"$error":"#VALUE!"}},{"$f":"(0.5 * ((100-(BETADIST(AS38,((COUNT(AA$30:AA38))/2)-1,((COUNT(AA$30:AA38))/2)-1))*100) + (100-(BETADIST(AZ38,((COUNT(AA$30:AA38))/2)-1,((COUNT(AA$30:AA38))/2)-1))*100) - 100) + 55) / 100","v":{"$error":"#DIV/0!"}},{"$f":"(0.5 * ((100-(BETADIST(AT38,((COUNT(AB$30:AB38))/2)-1,((COUNT(AB$30:AB38))/2)-1))*100) + (100-(BETADIST(BA38,((COUNT(AB$30:AB38))/2)-1,((COUNT(AB$30:AB38))/2)-1))*100) - 100) + 55) / 100","v":{"$error":"#DIV/0!"}},{"$error":"#VALUE!"}]
[null,null,null,null,null,null,null,null,null,null,null,null,null,null,null,null,null,null,null,null,null,null,null,null,null,null,"","",null,null,0,0,0,0,0,0,0,{"$f":"IF((MAX(0,(0.5-(($AL$21-AVERAGE($N$30:N39))/(IF(STDEV($N$30:N39)<0.01,0.01,STDEV($N$30:N39)))*SQRT(COUNT($N$30:N39))/(2*(COUNT($N$30:N39)-1))))))>1,1,(MAX(0,(0.5-(($AL$21-AVERAGE($N$30:N39))/(IF(STDEV($N$30:N39)<0.01,0.01,STDEV($N$30:N39)))*SQRT(COUNT($N$30:N39))/(2*(COUNT($N$30:N39)-1)))))))","v":{"$error":"#VALUE!"}},0,0,0,0,{"$f":"IF((MAX(0,(0.5-(($AQ$21-AVERAGE($S$30:S39))/(IF(STDEV($S$30:S39)<0.01,0.01,STDEV($S$30:S39)))*SQRT(COUNT($S$30:S39))/(2*(COUNT($S$30:S39)-1))))))>1,1,(MAX(0,(0.5-(($AQ$21-AVERAGE($S$30:S39))/(IF(STDEV($S$30:S39)<0.01,0.01,STDEV($S$30:S39)))*SQRT(COUNT($S$30:S39))/(2*(COUNT($S$30:S39)-1)))))))","v":{"$error":"#VALUE!"}},{"$f":"IF((MAX(0,(0.5-(($AR$21-AVERAGE($T$30:T39))/(IF(STDEV($T$30:T39)<0.01,0.01,STDEV($T$30:T39)))*SQRT(COUNT($T$30:T39))/(2*(COUNT($T$30:T39)-1))))))>1,1,(MAX(0,(0.5-(($AR$21-AVERAGE($T$30:T39))/(IF(STDEV($T$30:T39)<0.01,0.01,STDEV($T$30:T39)))*SQRT(COUNT($T$30:T39))/(2*(COUNT($T$30:T39)-1)))))))","v":{"$error":"#VALUE!"}},{"$f":"IF((MAX(0,(0.5-(($AS$21-AVERAGE($AA$30:AA39))/(IF(STDEV($AA$30:AA39)<0.01,0.01,STDEV($AA$30:AA39)))*SQRT(COUNT($AA$30:AA39))/(2*(COUNT($AA$30:AA39)-1))))))>1,1,(MAX(0,(0.5-(($AS$21-AVERAGE($AA$30:AA39))/(IF(STDEV($AA$30:AA39)<0.01,0.01,STDEV($AA$30:AA39)))*SQRT(COUNT($AA$30:AA39))/(2*(COUNT($AA$30:AA39)-1)))))))","v":{"$error":"#DIV/0!"}},{"$f":"IF((MAX(0,(0.5-(($AT$21-AVERAGE($AB$30:AB39))/(IF(STDEV($AB$30:AB39)<0.01,0.01,STDEV($AB$30:AB39)))*SQRT(COUNT($AB$30:AB39))/(2*(COUNT($AB$30:AB39)-1))))))>1,1,(MAX(0,(0.5-(($AT$21-AVERAGE($AB$30:AB39))/(IF(STDEV($AB$30:AB39)<0.01,0.01,STDEV($AB$30:AB39)))*SQRT(COUNT($AB$30:AB39))/(2*(COUNT($AB$30:AB39)-1)))))))","v":{"$error":"#DIV/0!"}},null,null,{"$f":"IF((MAX(0,(0.5-((AVERAGE($N$30:N39)-$AW$22)/(IF(STDEV($N$30:N39)<0.01,0.01,STDEV($N$30:N39)))*SQRT(COUNT($N$30:N39))/(2*(COUNT($N$30:N39)-1))))))>1,1,(MAX(0,(0.5-((AVERAGE($N$30:N39)-$AW$22)/(IF(STDEV($N$30:N39)<0.01,0.01,STDEV($N$30:N39)))*SQRT(COUNT($N$30:N39))/(2*(COUNT($N$30:N39)-1)))))))","v":{"$error":"#DIV/0!"}},{"$f":"IF((MAX(0,(0.5-((AVERAGE($S$30:S39)-$AX$22)/(IF(STDEV($S$30:S39)<0.01,0.01,STDEV($S$30:S39)))*SQRT(COUNT($S$30:S39))/(2*(COUNT($S$30:S39)-1))))))>1,1,(MAX(0,(0.5-((AVERAGE($S$30:S39)-$AX$22)/(IF(STDEV($S$30:S39)<0.01,0.01,STDEV($S$30:S39)))*SQRT(COUNT($S$30:S39))/(2*(COUNT($S$30:S39)-1)))))))","v":{"$error":"#DIV/0!"}},{"$f":"IF((MAX(0,(0.5-((AVERAGE($T$30:T39)-$AY$22)/(IF(STDEV($T$30:T39)<0.01,0.01,STDEV($T$30:T39)))*SQRT(COUNT($T$30:T39))/(2*(COUNT($T$30:T39)-1))))))>1,1,(MAX(0,(0.5-((AVERAGE($T$30:T39)-$AY$22)/(IF(STDEV($T$30:T39)<0.01,0.01,STDEV($T$30:T39)))*SQRT(COUNT($T$30:T39))/(2*(COUNT($T$30:T39)-1)))))))","v":{"$error":"#DIV/0!"}},{"$f":"IF((MAX(0,(0.5-((AVERAGE($AA$30:AA39)-$AZ$22)/(IF(STDEV($AA$30:AA39)<0.01,0.01,STDEV($AA$30:AA39)))*SQRT(COUNT($AA$30:AA39))/(2*(COUNT($AA$30:AA39)-1))))))>1,1,(MAX(0,(0.5-((AVERAGE($AA$30:AA39)-$AZ$22)/(IF(STDEV($AA$30:AA39)<0.01,0.01,STDEV($AA$30:AA39)))*SQRT(COUNT($AA$30:AA39))/(2*(COUNT($AA$30:AA39)-1)))))))","v":{"$error":"#DIV/0!"}},{"$f":"IF((MAX(0,(0.5-((AVERAGE($AB$30:AB39)-$BA$22)/(IF(STDEV($AB$30:AB39)<0.01,0.01,STDEV($AB$30:AB39)))*SQRT(COUNT($AB$30:AB39))/(2*(COUNT($AB$30:AB39)-1))))))>1,1,(MAX(0,(0.5-((AVERAGE($AB$30:AB39)-$BA$22)/(IF(STDEV($AB$30:AB39)<0.01,0.01,STDEV($AB$30:AB39)))*SQRT(COUNT($AB$30:AB39))/(2*(COUNT($AB$30:AB39)-1)))))))","v":{"$error":"#DIV/0!"}},null,null,null,{"$f":"(0.5 * ((100-(BETADIST(AL39,((COUNT(N$30:N39))/2)-1,((COUNT(N$30:N39))/2)-1))*100) + (100-(BETADIST(AW39,((COUNT(N$30:N39))/2)-1,((COUNT(N$30:N39))/2)-1))*100) - 100) + 55) / 100","v":{"$error":"#VALUE!"}},{"$f":"(0.5 * ((100-(BETADIST(AQ39,((COUNT(S$30:S39))/2)-1,((COUNT(S$30:S39))/2)-1))*100) + (100-(BETADIST(AX39,((COUNT(S$30:S39))/2)-1,((COUNT(S$30:S39))/2)-1))*100) - 100) + 55) / 100","v":{"$error":"#VALUE!"}},{"$f":"(0.5 * ((100-(BETADIST(AR39,((COUNT(T$30:T39))/2)-1,((COUNT(T$30:T39))/2)-1))*100) + (100-(BETADIST(AY39,((COUNT(T$30:T39))/2)-1,((COUNT(T$30:T39))/2)-1))*100) - 100) + 55) / 100","v":{"$error":"#VALUE!"}},{"$f":"(0.5 * ((100-(BETADIST(AS39,((COUNT(AA$30:AA39))/2)-1,((COUNT(AA$30:AA39))/2)-1))*100) + (100-(BETADIST(AZ39,((COUNT(AA$30:AA39))/2)-1,((COUNT(AA$30:AA39))/2)-1))*100) - 100) + 55) / 100","v":{"$error":"#DIV/0!"}},{"$f":"(0.5 * ((100-(BETADIST(AT39,((COUNT(AB$30:AB39))/2)-1,((COUNT(AB$30:AB39))/2)-1))*100) + (100-(BETADIST(BA39,((COUNT(AB$30:AB39))/2)-1,((COUNT(AB$30:AB39))/2)-1))*100) - 100) + 55) / 100","v":{"$error":"#DIV/0!"}},{"$error":"#VALUE!"}]
[null,null,null,null,null,null,null,null,null,null,null,null,null,null,null,null,null,null,null,null,null,null,null,null,null,null,"","",null,null,0,0,0,0,0,0,0,{"$f":"IF((MAX(0,(0.5-(($AL$21-AVERAGE($N$30:N40))/(IF(STDEV($N$30:N40)<0.01,0.01,STDEV($N$30:N40)))*SQRT(COUNT($N$30:N40))/(2*(COUNT($N$30:N40)-1))))))>1,1,(MAX(0,(0.5-(($AL$21-AVERAGE($N$30:N40))/(IF(STDEV($N$30:N40)<0.01,0.01,STDEV($N$30:N40)))*SQRT(COUNT($N$30:N40))/(2*(COUNT($N$30:N40)-1)))))))","v":{"$error":"#VALUE!"}},0,0,0,0,{"$f":"IF((MAX(0,(0.5-(($AQ$21-AVERAGE($S$30:S40))/(IF(STDEV($S$30:S40)<0.01,0.01,STDEV($S$30:S40)))*SQRT(COUNT($S$30:S40))/(2*(COUNT($S$30:S40)-1))))))>1,1,(MAX(0,(0.5-(($AQ$21-AVERAGE($S$30:S40))/(IF(STDEV($S$30:S40)<0.01,0.01,STDEV($S$30:S40)))*SQRT(COUNT($S$30:S40))/(2*(COUNT($S$30:S40)-1)))))))","v":{"$error":"#VALUE!"}},{"$f":"IF((MAX(0,(0.5-(($AR$21-AVERAGE($T$30:T40))/(IF(STDEV($T$30:T40)<0.01,0.01,STDEV($T$30:T40)))*SQRT(COUNT($T$30:T40))/(2*(COUNT($T$30:T40)-1))))))>1,1,(MAX(0,(0.5-(($AR$21-AVERAGE($T$30:T40))/(IF(STDEV($T$30:T40)<0.01,0.01,STDEV($T$30:T40)))*SQRT(COUNT($T$30:T40))/(2*(COUNT($T$30:T40)-1)))))))","v":{"$error":"#VALUE!"}},{"$f":"IF((MAX(0,(0.5-(($AS$21-AVERAGE($AA$30:AA40))/(IF(STDEV($AA$30:AA40)<0.01,0.01,STDEV($AA$30:AA40)))*SQRT(COUNT($AA$30:AA40))/(2*(COUNT($AA$30:AA40)-1))))))>1,1,(MAX(0,(0.5-(($AS$21-AVERAGE($AA$30:AA40))/(IF(STDEV($AA$30:AA40)<0.01,0.01,STDEV($AA$30:AA40)))*SQRT(COUNT($AA$30:AA40))/(2*(COUNT($AA$30:AA40)-1)))))))","v":{"$error":"#DIV/0!"}},{"$f":"IF((MAX(0,(0.5-(($AT$21-AVERAGE($AB$30:AB40))/(IF(STDEV($AB$30:AB40)<0.01,0.01,STDEV($AB$30:AB40)))*SQRT(COUNT($AB$30:AB40))/(2*(COUNT($AB$30:AB40)-1))))))>1,1,(MAX(0,(0.5-(($AT$21-AVERAGE($AB$30:AB40))/(IF(STDEV($AB$30:AB40)<0.01,0.01,STDEV($AB$30:AB40)))*SQRT(COUNT($AB$30:AB40))/(2*(COUNT($AB$30:AB40)-1)))))))","v":{"$error":"#DIV/0!"}},null,null,{"$f":"IF((MAX(0,(0.5-((AVERAGE($N$30:N40)-$AW$22)/(IF(STDEV($N$30:N40)<0.01,0.01,STDEV($N$30:N40)))*SQRT(COUNT($N$30:N40))/(2*(COUNT($N$30:N40)-1))))))>1,1,(MAX(0,(0.5-((AVERAGE($N$30:N40)-$AW$22)/(IF(STDEV($N$30:N40)<0.01,0.01,STDEV($N$30:N40)))*SQRT(COUNT($N$30:N40))/(2*(COUNT($N$30:N40)-1)))))))","v":{"$error":"#DIV/0!"}},{"$f":"IF((MAX(0,(0.5-((AVERAGE($S$30:S40)-$AX$22)/(IF(STDEV($S$30:S40)<0.01,0.01,STDEV($S$30:S40)))*SQRT(COUNT($S$30:S40))/(2*(COUNT($S$30:S40)-1))))))>1,1,(MAX(0,(0.5-((AVERAGE($S$30:S40)-$AX$22)/(IF(STDEV($S$30:S40)<0.01,0.01,STDEV($S$30:S40)))*SQRT(COUNT($S$30:S40))/(2*(COUNT($S$30:S40)-1)))))))","v":{"$error":"#DIV/0!"}},{"$f":"IF((MAX(0,(0.5-((AVERAGE($T$30:T40)-$AY$22)/(IF(STDEV($T$30:T40)<0.01,0.01,STDEV($T$30:T40)))*SQRT(COUNT($T$30:T40))/(2*(COUNT($T$30:T40)-1))))))>1,1,(MAX(0,(0.5-((AVERAGE($T$30:T40)-$AY$22)/(IF(STDEV($T$30:T40)<0.01,0.01,STDEV($T$30:T40)))*SQRT(COUNT($T$30:T40))/(2*(COUNT($T$30:T40)-1)))))))","v":{"$error":"#DIV/0!"}},{"$f":"IF((MAX(0,(0.5-((AVERAGE($AA$30:AA40)-$AZ$22)/(IF(STDEV($AA$30:AA40)<0.01,0.01,STDEV($AA$30:AA40)))*SQRT(COUNT($AA$30:AA40))/(2*(COUNT($AA$30:AA40)-1))))))>1,1,(MAX(0,(0.5-((AVERAGE($AA$30:AA40)-$AZ$22)/(IF(STDEV($AA$30:AA40)<0.01,0.01,STDEV($AA$30:AA40)))*SQRT(COUNT($AA$30:AA40))/(2*(COUNT($AA$30:AA40)-1)))))))","v":{"$error":"#DIV/0!"}},{"$f":"IF((MAX(0,(0.5-((AVERAGE($AB$30:AB40)-$BA$22)/(IF(STDEV($AB$30:AB40)<0.01,0.01,STDEV($AB$30:AB40)))*SQRT(COUNT($AB$30:AB40))/(2*(COUNT($AB$30:AB40)-1))))))>1,1,(MAX(0,(0.5-((AVERAGE($AB$30:AB40)-$BA$22)/(IF(STDEV($AB$30:AB40)<0.01,0.01,STDEV($AB$30:AB40)))*SQRT(COUNT($AB$30:AB40))/(2*(COUNT($AB$30:AB40)-1)))))))","v":{"$error":"#DIV/0!"}},null,null,null,{"$f":"(0.5 * ((100-(BETADIST(AL40,((COUNT(N$30:N40))/2)-1,((COUNT(N$30:N40))/2)-1))*100) + (100-(BETADIST(AW40,((COUNT(N$30:N40))/2)-1,((COUNT(N$30:N40))/2)-1))*100) - 100) + 55) / 100","v":{"$error":"#VALUE!"}},{"$f":"(0.5 * ((100-(BETADIST(AQ40,((COUNT(S$30:S40))/2)-1,((COUNT(S$30:S40))/2)-1))*100) + (100-(BETADIST(AX40,((COUNT(S$30:S40))/2)-1,((COUNT(S$30:S40))/2)-1))*100) - 100) + 55) / 100","v":{"$error":"#VALUE!"}},{"$f":"(0.5 * ((100-(BETADIST(AR40,((COUNT(T$30:T40))/2)-1,((COUNT(T$30:T40))/2)-1))*100) + (100-(BETADIST(AY40,((COUNT(T$30:T40))/2)-1,((COUNT(T$30:T40))/2)-1))*100) - 100) + 55) / 100","v":{"$error":"#VALUE!"}},{"$f":"(0.5 * ((100-(BETADIST(AS40,((COUNT(AA$30:AA40))/2)-1,((COUNT(AA$30:AA40))/2)-1))*100) + (100-(BETADIST(AZ40,((COUNT(AA$30:AA40))/2)-1,((COUNT(AA$30:AA40))/2)-1))*100) - 100) + 55) / 100","v":{"$error":"#DIV/0!"}},{"$f":"(0.5 * ((100-(BETADIST(AT40,((COUNT(AB$30:AB40))/2)-1,((COUNT(AB$30:AB40))/2)-1))*100) + (100-(BETADIST(BA40,((COUNT(AB$30:AB40))/2)-1,((COUNT(AB$30:AB40))/2)-1))*100) - 100) + 55) / 100","v":{"$error":"#DIV/0!"}},{"$error":"#VALUE!"}]
[null,null,null,null,null,null,null,null,null,null,null,null,null,null,null,null,null,null,null,null,null,null,null,null,null,null,"","",null,null,0,0,0,0,0,0,0,{"$f":"IF((MAX(0,(0.5-(($AL$21-AVERAGE($N$30:N41))/(IF(STDEV($N$30:N41)<0.01,0.01,STDEV($N$30:N41)))*SQRT(COUNT($N$30:N41))/(2*(COUNT($N$30:N41)-1))))))>1,1,(MAX(0,(0.5-(($AL$21-AVERAGE($N$30:N41))/(IF(STDEV($N$30:N41)<0.01,0.01,STDEV($N$30:N41)))*SQRT(COUNT($N$30:N41))/(2*(COUNT($N$30:N41)-1)))))))","v":{"$error":"#VALUE!"}},0,0,0,0,{"$f":"IF((MAX(0,(0.5-(($AQ$21-AVERAGE($S$30:S41))/(IF(STDEV($S$30:S41)<0.01,0.01,STDEV($S$30:S41)))*SQRT(COUNT($S$30:S41))/(2*(COUNT($S$30:S41)-1))))))>1,1,(MAX(0,(0.5-(($AQ$21-AVERAGE($S$30:S41))/(IF(STDEV($S$30:S41)<0.01,0.01,STDEV($S$30:S41)))*SQRT(COUNT($S$30:S41))/(2*(COUNT($S$30:S41)-1)))))))","v":{"$error":"#VALUE!"}},{"$f":"IF((MAX(0,(0.5-(($AR$21-AVERAGE($T$30:T41))/(IF(STDEV($T$30:T41)<0.01,0.01,STDEV($T$30:T41)))*SQRT(COUNT($T$30:T41))/(2*(COUNT($T$30:T41)-1))))))>1,1,(MAX(0,(0.5-(($AR$21-AVERAGE($T$30:T41))/(IF(STDEV($T$30:T41)<0.01,0.01,STDEV($T$30:T41)))*SQRT(COUNT($T$30:T41))/(2*(COUNT($T$30:T41)-1)))))))","v":{"$error":"#VALUE!"}},{"$f":"IF((MAX(0,(0.5-(($AS$21-AVERAGE($AA$30:AA41))/(IF(STDEV($AA$30:AA41)<0.01,0.01,STDEV($AA$30:AA41)))*SQRT(COUNT($AA$30:AA41))/(2*(COUNT($AA$30:AA41)-1))))))>1,1,(MAX(0,(0.5-(($AS$21-AVERAGE($AA$30:AA41))/(IF(STDEV($AA$30:AA41)<0.01,0.01,STDEV($AA$30:AA41)))*SQRT(COUNT($AA$30:AA41))/(2*(COUNT($AA$30:AA41)-1)))))))","v":{"$error":"#DIV/0!"}},{"$f":"IF((MAX(0,(0.5-(($AT$21-AVERAGE($AB$30:AB41))/(IF(STDEV($AB$30:AB41)<0.01,0.01,STDEV($AB$30:AB41)))*SQRT(COUNT($AB$30:AB41))/(2*(COUNT($AB$30:AB41)-1))))))>1,1,(MAX(0,(0.5-(($AT$21-AVERAGE($AB$30:AB41))/(IF(STDEV($AB$30:AB41)<0.01,0.01,STDEV($AB$30:AB41)))*SQRT(COUNT($AB$30:AB41))/(2*(COUNT($AB$30:AB41)-1)))))))","v":{"$error":"#DIV/0!"}},null,null,{"$f":"IF((MAX(0,(0.5-((AVERAGE($N$30:N41)-$AW$22)/(IF(STDEV($N$30:N41)<0.01,0.01,STDEV($N$30:N41)))*SQRT(COUNT($N$30:N41))/(2*(COUNT($N$30:N41)-1))))))>1,1,(MAX(0,(0.5-((AVERAGE($N$30:N41)-$AW$22)/(IF(STDEV($N$30:N41)<0.01,0.01,STDEV($N$30:N41)))*SQRT(COUNT($N$30:N41))/(2*(COUNT($N$30:N41)-1)))))))","v":{"$error":"#DIV/0!"}},{"$f":"IF((MAX(0,(0.5-((AVERAGE($S$30:S41)-$AX$22)/(IF(STDEV($S$30:S41)<0.01,0.01,STDEV($S$30:S41)))*SQRT(COUNT($S$30:S41))/(2*(COUNT($S$30:S41)-1))))))>1,1,(MAX(0,(0.5-((AVERAGE($S$30:S41)-$AX$22)/(IF(STDEV($S$30:S41)<0.01,0.01,STDEV($S$30:S41)))*SQRT(COUNT($S$30:S41))/(2*(COUNT($S$30:S41)-1)))))))","v":{"$error":"#DIV/0!"}},{"$f":"IF((MAX(0,(0.5-((AVERAGE($T$30:T41)-$AY$22)/(IF(STDEV($T$30:T41)<0.01,0.01,STDEV($T$30:T41)))*SQRT(COUNT($T$30:T41))/(2*(COUNT($T$30:T41)-1))))))>1,1,(MAX(0,(0.5-((AVERAGE($T$30:T41)-$AY$22)/(IF(STDEV($T$30:T41)<0.01,0.01,STDEV($T$30:T41)))*SQRT(COUNT($T$30:T41))/(2*(COUNT($T$30:T41)-1)))))))","v":{"$error":"#DIV/0!"}},{"$f":"IF((MAX(0,(0.5-((AVERAGE($AA$30:AA41)-$AZ$22)/(IF(STDEV($AA$30:AA41)<0.01,0.01,STDEV($AA$30:AA41)))*SQRT(COUNT($AA$30:AA41))/(2*(COUNT($AA$30:AA41)-1))))))>1,1,(MAX(0,(0.5-((AVERAGE($AA$30:AA41)-$AZ$22)/(IF(STDEV($AA$30:AA41)<0.01,0.01,STDEV($AA$30:AA41)))*SQRT(COUNT($AA$30:AA41))/(2*(COUNT($AA$30:AA41)-1)))))))","v":{"$error":"#DIV/0!"}},{"$f":"IF((MAX(0,(0.5-((AVERAGE($AB$30:AB41)-$BA$22)/(IF(STDEV($AB$30:AB41)<0.01,0.01,STDEV($AB$30:AB41)))*SQRT(COUNT($AB$30:AB41))/(2*(COUNT($AB$30:AB41)-1))))))>1,1,(MAX(0,(0.5-((AVERAGE($AB$30:AB41)-$BA$22)/(IF(STDEV($AB$30:AB41)<0.01,0.01,STDEV($AB$30:AB41)))*SQRT(COUNT($AB$30:AB41))/(2*(COUNT($AB$30:AB41)-1)))))))","v":{"$error":"#DIV/0!"}},null,null,null,{"$f":"(0.5 * ((100-(BETADIST(AL41,((COUNT(N$30:N41))/2)-1,((COUNT(N$30:N41))/2)-1))*100) + (100-(BETADIST(AW41,((COUNT(N$30:N41))/2)-1,((COUNT(N$30:N41))/2)-1))*100) - 100) + 55) / 100","v":{"$error":"#VALUE!"}},{"$f":"(0.5 * ((100-(BETADIST(AQ41,((COUNT(S$30:S41))/2)-1,((COUNT(S$30:S41))/2)-1))*100) + (100-(BETADIST(AX41,((COUNT(S$30:S41))/2)-1,((COUNT(S$30:S41))/2)-1))*100) - 100) + 55) / 100","v":{"$error":"#VALUE!"}},{"$f":"(0.5 * ((100-(BETADIST(AR41,((COUNT(T$30:T41))/2)-1,((COUNT(T$30:T41))/2)-1))*100) + (100-(BETADIST(AY41,((COUNT(T$30:T41))/2)-1,((COUNT(T$30:T41))/2)-1))*100) - 100) + 55) / 100","v":{"$error":"#VALUE!"}},{"$f":"(0.5 * ((100-(BETADIST(AS41,((COUNT(AA$30:AA41))/2)-1,((COUNT(AA$30:AA41))/2)-1))*100) + (100-(BETADIST(AZ41,((COUNT(AA$30:AA41))/2)-1,((COUNT(AA$30:AA41))/2)-1))*100) - 100) + 55) / 100","v":{"$error":"#DIV/0!"}},{"$f":"(0.5 * ((100-(BETADIST(AT41,((COUNT(AB$30:AB41))/2)-1,((COUNT(AB$30:AB41))/2)-1))*100) + (100-(BETADIST(BA41,((COUNT(AB$30:AB41))/2)-1,((COUNT(AB$30:AB41))/2)-1))*100) - 100) + 55) / 100","v":{"$error":"#DIV/0!"}},{"$error":"#VALUE!"}]
[null,null,null,null,null,null,null,null,null,null,null,null,null,null,null,null,null,null,null,null,null,null,null,null,null,null,"","",null,null,0,0,0,0,0,0,0,{"$f":"IF((MAX(0,(0.5-(($AL$21-AVERAGE($N$30:N42))/(IF(STDEV($N$30:N42)<0.01,0.01,STDEV($N$30:N42)))*SQRT(COUNT($N$30:N42))/(2*(COUNT($N$30:N42)-1))))))>1,1,(MAX(0,(0.5-(($AL$21-AVERAGE($N$30:N42))/(IF(STDEV($N$30:N42)<0.01,0.01,STDEV($N$30:N42)))*SQRT(COUNT($N$30:N42))/(2*(COUNT($N$30:N42)-1)))))))","v":{"$error":"#VALUE!"}},0,0,0,0,{"$f":"IF((MAX(0,(0.5-(($AQ$21-AVERAGE($S$30:S42))/(IF(STDEV($S$30:S42)<0.01,0.01,STDEV($S$30:S42)))*SQRT(COUNT($S$30:S42))/(2*(COUNT($S$30:S42)-1))))))>1,1,(MAX(0,(0.5-(($AQ$21-AVERAGE($S$30:S42))/(IF(STDEV($S$30:S42)<0.01,0.01,STDEV($S$30:S42)))*SQRT(COUNT($S$30:S42))/(2*(COUNT($S$30:S42)-1)))))))","v":{"$error":"#VALUE!"}},{"$f":"IF((MAX(0,(0.5-(($AR$21-AVERAGE($T$30:T42))/(IF(STDEV($T$30:T42)<0.01,0.01,STDEV($T$30:T42)))*SQRT(COUNT($T$30:T42))/(2*(COUNT($T$30:T42)-1))))))>1,1,(MAX(0,(0.5-(($AR$21-AVERAGE($T$30:T42))/(IF(STDEV($T$30:T42)<0.01,0.01,STDEV($T$30:T42)))*SQRT(COUNT($T$30:T42))/(2*(COUNT($T$30:T42)-1)))))))","v":{"$error":"#VALUE!"}},{"$f":"IF((MAX(0,(0.5-(($AS$21-AVERAGE($AA$30:AA42))/(IF(STDEV($AA$30:AA42)<0.01,0.01,STDEV($AA$30:AA42)))*SQRT(COUNT($AA$30:AA42))/(2*(COUNT($AA$30:AA42)-1))))))>1,1,(MAX(0,(0.5-(($AS$21-AVERAGE($AA$30:AA42))/(IF(STDEV($AA$30:AA42)<0.01,0.01,STDEV($AA$30:AA42)))*SQRT(COUNT($AA$30:AA42))/(2*(COUNT($AA$30:AA42)-1)))))))","v":{"$error":"#DIV/0!"}},{"$f":"IF((MAX(0,(0.5-(($AT$21-AVERAGE($AB$30:AB42))/(IF(STDEV($AB$30:AB42)<0.01,0.01,STDEV($AB$30:AB42)))*SQRT(COUNT($AB$30:AB42))/(2*(COUNT($AB$30:AB42)-1))))))>1,1,(MAX(0,(0.5-(($AT$21-AVERAGE($AB$30:AB42))/(IF(STDEV($AB$30:AB42)<0.01,0.01,STDEV($AB$30:AB42)))*SQRT(COUNT($AB$30:AB42))/(2*(COUNT($AB$30:AB42)-1)))))))","v":{"$error":"#DIV/0!"}},null,null,{"$f":"IF((MAX(0,(0.5-((AVERAGE($N$30:N42)-$AW$22)/(IF(STDEV($N$30:N42)<0.01,0.01,STDEV($N$30:N42)))*SQRT(COUNT($N$30:N42))/(2*(COUNT($N$30:N42)-1))))))>1,1,(MAX(0,(0.5-((AVERAGE($N$30:N42)-$AW$22)/(IF(STDEV($N$30:N42)<0.01,0.01,STDEV($N$30:N42)))*SQRT(COUNT($N$30:N42))/(2*(COUNT($N$30:N42)-1)))))))","v":{"$error":"#DIV/0!"}},{"$f":"IF((MAX(0,(0.5-((AVERAGE($S$30:S42)-$AX$22)/(IF(STDEV($S$30:S42)<0.01,0.01,STDEV($S$30:S42)))*SQRT(COUNT($S$30:S42))/(2*(COUNT($S$30:S42)-1))))))>1,1,(MAX(0,(0.5-((AVERAGE($S$30:S42)-$AX$22)/(IF(STDEV($S$30:S42)<0.01,0.01,STDEV($S$30:S42)))*SQRT(COUNT($S$30:S42))/(2*(COUNT($S$30:S42)-1)))))))","v":{"$error":"#DIV/0!"}},{"$f":"IF((MAX(0,(0.5-((AVERAGE($T$30:T42)-$AY$22)/(IF(STDEV($T$30:T42)<0.01,0.01,STDEV($T$30:T42)))*SQRT(COUNT($T$30:T42))/(2*(COUNT($T$30:T42)-1))))))>1,1,(MAX(0,(0.5-((AVERAGE($T$30:T42)-$AY$22)/(IF(STDEV($T$30:T42)<0.01,0.01,STDEV($T$30:T42)))*SQRT(COUNT($T$30:T42))/(2*(COUNT($T$30:T42)-1)))))))","v":{"$error":"#DIV/0!"}},{"$f":"IF((MAX(0,(0.5-((AVERAGE($AA$30:AA42)-$AZ$22)/(IF(STDEV($AA$30:AA42)<0.01,0.01,STDEV($AA$30:AA42)))*SQRT(COUNT($AA$30:AA42))/(2*(COUNT($AA$30:AA42)-1))))))>1,1,(MAX(0,(0.5-((AVERAGE($AA$30:AA42)-$AZ$22)/(IF(STDEV($AA$30:AA42)<0.01,0.01,STDEV($AA$30:AA42)))*SQRT(COUNT($AA$30:AA42))/(2*(COUNT($AA$30:AA42)-1)))))))","v":{"$error":"#DIV/0!"}},{"$f":"IF((MAX(0,(0.5-((AVERAGE($AB$30:AB42)-$BA$22)/(IF(STDEV($AB$30:AB42)<0.01,0.01,STDEV($AB$30:AB42)))*SQRT(COUNT($AB$30:AB42))/(2*(COUNT($AB$30:AB42)-1))))))>1,1,(MAX(0,(0.5-((AVERAGE($AB$30:AB42)-$BA$22)/(IF(STDEV($AB$30:AB42)<0.01,0.01,STDEV($AB$30:AB42)))*SQRT(COUNT($AB$30:AB42))/(2*(COUNT($AB$30:AB42)-1)))))))","v":{"$error":"#DIV/0!"}},null,null,null,{"$f":"(0.5 * ((100-(BETADIST(AL42,((COUNT(N$30:N42))/2)-1,((COUNT(N$30:N42))/2)-1))*100) + (100-(BETADIST(AW42,((COUNT(N$30:N42))/2)-1,((COUNT(N$30:N42))/2)-1))*100) - 100) + 55) / 100","v":{"$error":"#VALUE!"}},{"$f":"(0.5 * ((100-(BETADIST(AQ42,((COUNT(S$30:S42))/2)-1,((COUNT(S$30:S42))/2)-1))*100) + (100-(BETADIST(AX42,((COUNT(S$30:S42))/2)-1,((COUNT(S$30:S42))/2)-1))*100) - 100) + 55) / 100","v":{"$error":"#VALUE!"}},{"$f":"(0.5 * ((100-(BETADIST(AR42,((COUNT(T$30:T42))/2)-1,((COUNT(T$30:T42))/2)-1))*100) + (100-(BETADIST(AY42,((COUNT(T$30:T42))/2)-1,((COUNT(T$30:T42))/2)-1))*100) - 100) + 55) / 100","v":{"$error":"#VALUE!"}},{"$f":"(0.5 * ((100-(BETADIST(AS42,((COUNT(AA$30:AA42))/2)-1,((COUNT(AA$30:AA42))/2)-1))*100) + (100-(BETADIST(AZ42,((COUNT(AA$30:AA42))/2)-1,((COUNT(AA$30:AA42))/2)-1))*100) - 100) + 55) / 100","v":{"$error":"#DIV/0!"}},{"$f":"(0.5 * ((100-(BETADIST(AT42,((COUNT(AB$30:AB42))/2)-1,((COUNT(AB$30:AB42))/2)-1))*100) + (100-(BETADIST(BA42,((COUNT(AB$30:AB42))/2)-1,((COUNT(AB$30:AB42))/2)-1))*100) - 100) + 55) / 100","v":{"$error":"#DIV/0!"}},{"$error":"#VALUE!"}]
[null,null,null,null,null,null,null,null,null,null,null,null,null,null,null,null,null,null,null,null,null,null,null,null,null,null,"","",null,null,0,0,0,0,0,0,0,{"$f":"IF((MAX(0,(0.5-(($AL$21-AVERAGE($N$30:N43))/(IF(STDEV($N$30:N43)<0.01,0.01,STDEV($N$30:N43)))*SQRT(COUNT($N$30:N43))/(2*(COUNT($N$30:N43)-1))))))>1,1,(MAX(0,(0.5-(($AL$21-AVERAGE($N$30:N43))/(IF(STDEV($N$30:N43)<0.01,0.01,STDEV($N$30:N43)))*SQRT(COUNT($N$30:N43))/(2*(COUNT($N$30:N43)-1)))))))","v":{"$error":"#VALUE!"}},0,0,0,0,{"$f":"IF((MAX(0,(0.5-(($AQ$21-AVERAGE($S$30:S43))/(IF(STDEV($S$30:S43)<0.01,0.01,STDEV($S$30:S43)))*SQRT(COUNT($S$30:S43))/(2*(COUNT($S$30:S43)-1))))))>1,1,(MAX(0,(0.5-(($AQ$21-AVERAGE($S$30:S43))/(IF(STDEV($S$30:S43)<0.01,0.01,STDEV($S$30:S43)))*SQRT(COUNT($S$30:S43))/(2*(COUNT($S$30:S43)-1)))))))","v":{"$error":"#VALUE!"}},{"$f":"IF((MAX(0,(0.5-(($AR$21-AVERAGE($T$30:T43))/(IF(STDEV($T$30:T43)<0.01,0.01,STDEV($T$30:T43)))*SQRT(COUNT($T$30:T43))/(2*(COUNT($T$30:T43)-1))))))>1,1,(MAX(0,(0.5-(($AR$21-AVERAGE($T$30:T43))/(IF(STDEV($T$30:T43)<0.01,0.01,STDEV($T$30:T43)))*SQRT(COUNT($T$30:T43))/(2*(COUNT($T$30:T43)-1)))))))","v":{"$error":"#VALUE!"}},{"$f":"IF((MAX(0,(0.5-(($AS$21-AVERAGE($AA$30:AA43))/(IF(STDEV($AA$30:AA43)<0.01,0.01,STDEV($AA$30:AA43)))*SQRT(COUNT($AA$30:AA43))/(2*(COUNT($AA$30:AA43)-1))))))>1,1,(MAX(0,(0.5-(($AS$21-AVERAGE($AA$30:AA43))/(IF(STDEV($AA$30:AA43)<0.01,0.01,STDEV($AA$30:AA43)))*SQRT(COUNT($AA$30:AA43))/(2*(COUNT($AA$30:AA43)-1)))))))","v":{"$error":"#DIV/0!"}},{"$f":"IF((MAX(0,(0.5-(($AT$21-AVERAGE($AB$30:AB43))/(IF(STDEV($AB$30:AB43)<0.01,0.01,STDEV($AB$30:AB43)))*SQRT(COUNT($AB$30:AB43))/(2*(COUNT($AB$30:AB43)-1))))))>1,1,(MAX(0,(0.5-(($AT$21-AVERAGE($AB$30:AB43))/(IF(STDEV($AB$30:AB43)<0.01,0.01,STDEV($AB$30:AB43)))*SQRT(COUNT($AB$30:AB43))/(2*(COUNT($AB$30:AB43)-1)))))))","v":{"$error":"#DIV/0!"}},null,null,{"$f":"IF((MAX(0,(0.5-((AVERAGE($N$30:N43)-$AW$22)/(IF(STDEV($N$30:N43)<0.01,0.01,STDEV($N$30:N43)))*SQRT(COUNT($N$30:N43))/(2*(COUNT($N$30:N43)-1))))))>1,1,(MAX(0,(0.5-((AVERAGE($N$30:N43)-$AW$22)/(IF(STDEV($N$30:N43)<0.01,0.01,STDEV($N$30:N43)))*SQRT(COUNT($N$30:N43))/(2*(COUNT($N$30:N43)-1)))))))","v":{"$error":"#DIV/0!"}},{"$f":"IF((MAX(0,(0.5-((AVERAGE($S$30:S43)-$AX$22)/(IF(STDEV($S$30:S43)<0.01,0.01,STDEV($S$30:S43)))*SQRT(COUNT($S$30:S43))/(2*(COUNT($S$30:S43)-1))))))>1,1,(MAX(0,(0.5-((AVERAGE($S$30:S43)-$AX$22)/(IF(STDEV($S$30:S43)<0.01,0.01,STDEV($S$30:S43)))*SQRT(COUNT($S$30:S43))/(2*(COUNT($S$30:S43)-1)))))))","v":{"$error":"#DIV/0!"}},{"$f":"IF((MAX(0,(0.5-((AVERAGE($T$30:T43)-$AY$22)/(IF(STDEV($T$30:T43)<0.01,0.01,STDEV($T$30:T43)))*SQRT(COUNT($T$30:T43))/(2*(COUNT($T$30:T43)-1))))))>1,1,(MAX(0,(0.5-((AVERAGE($T$30:T43)-$AY$22)/(IF(STDEV($T$30:T43)<0.01,0.01,STDEV($T$30:T43)))*SQRT(COUNT($T$30:T43))/(2*(COUNT($T$30:T43)-1)))))))","v":{"$error":"#DIV/0!"}},{"$f":"IF((MAX(0,(0.5-((AVERAGE($AA$30:AA43)-$AZ$22)/(IF(STDEV($AA$30:AA43)<0.01,0.01,STDEV($AA$30:AA43)))*SQRT(COUNT($AA$30:AA43))/(2*(COUNT($AA$30:AA43)-1))))))>1,1,(MAX(0,(0.5-((AVERAGE($AA$30:AA43)-$AZ$22)/(IF(STDEV($AA$30:AA43)<0.01,0.01,STDEV($AA$30:AA43)))*SQRT(COUNT($AA$30:AA43))/(2*(COUNT($AA$30:AA43)-1)))))))","v":{"$error":"#DIV/0!"}},{"$f":"IF((MAX(0,(0.5-((AVERAGE($AB$30:AB43)-$BA$22)/(IF(STDEV($AB$30:AB43)<0.01,0.01,STDEV($AB$30:AB43)))*SQRT(COUNT($AB$30:AB43))/(2*(COUNT($AB$30:AB43)-1))))))>1,1,(MAX(0,(0.5-((AVERAGE($AB$30:AB43)-$BA$22)/(IF(STDEV($AB$30:AB43)<0.01,0.01,STDEV($AB$30:AB43)))*SQRT(COUNT($AB$30:AB43))/(2*(COUNT($AB$30:AB43)-1)))))))","v":{"$error":"#DIV/0!"}},null,null,null,{"$f":"(0.5 * ((100-(BETADIST(AL43,((COUNT(N$30:N43))/2)-1,((COUNT(N$30:N43))/2)-1))*100) + (100-(BETADIST(AW43,((COUNT(N$30:N43))/2)-1,((COUNT(N$30:N43))/2)-1))*100) - 100) + 55) / 100","v":{"$error":"#VALUE!"}},{"$f":"(0.5 * ((100-(BETADIST(AQ43,((COUNT(S$30:S43))/2)-1,((COUNT(S$30:S43))/2)-1))*100) + (100-(BETADIST(AX43,((COUNT(S$30:S43))/2)-1,((COUNT(S$30:S43))/2)-1))*100) - 100) + 55) / 100","v":{"$error":"#VALUE!"}},{"$f":"(0.5 * ((100-(BETADIST(AR43,((COUNT(T$30:T43))/2)-1,((COUNT(T$30:T43))/2)-1))*100) + (100-(BETADIST(AY43,((COUNT(T$30:T43))/2)-1,((COUNT(T$30:T43))/2)-1))*100) - 100) + 55) / 100","v":{"$error":"#VALUE!"}},{"$f":"(0.5 * ((100-(BETADIST(AS43,((COUNT(AA$30:AA43))/2)-1,((COUNT(AA$30:AA43))/2)-1))*100) + (100-(BETADIST(AZ43,((COUNT(AA$30:AA43))/2)-1,((COUNT(AA$30:AA43))/2)-1))*100) - 100) + 55) / 100","v":{"$error":"#DIV/0!"}},{"$f":"(0.5 * ((100-(BETADIST(AT43,((COUNT(AB$30:AB43))/2)-1,((COUNT(AB$30:AB43))/2)-1))*100) + (100-(BETADIST(BA43,((COUNT(AB$30:AB43))/2)-1,((COUNT(AB$30:AB43))/2)-1))*100) - 100) + 55) / 100","v":{"$error":"#DIV/0!"}},{"$error":"#VALUE!"}]
[null,null,null,null,null,null,null,null,null,null,null,null,null,null,null,null,null,null,null,null,null,null,null,null,null,null,"","",null,null,0,0,0,0,0,0,0,{"$f":"IF((MAX(0,(0.5-(($AL$21-AVERAGE($N$30:N44))/(IF(STDEV($N$30:N44)<0.01,0.01,STDEV($N$30:N44)))*SQRT(COUNT($N$30:N44))/(2*(COUNT($N$30:N44)-1))))))>1,1,(MAX(0,(0.5-(($AL$21-AVERAGE($N$30:N44))/(IF(STDEV($N$30:N44)<0.01,0.01,STDEV($N$30:N44)))*SQRT(COUNT($N$30:N44))/(2*(COUNT($N$30:N44)-1)))))))","v":{"$error":"#VALUE!"}},0,0,0,0,{"$f":"IF((MAX(0,(0.5-(($AQ$21-AVERAGE($S$30:S44))/(IF(STDEV($S$30:S44)<0.01,0.01,STDEV($S$30:S44)))*SQRT(COUNT($S$30:S44))/(2*(COUNT($S$30:S44)-1))))))>1,1,(MAX(0,(0.5-(($AQ$21-AVERAGE($S$30:S44))/(IF(STDEV($S$30:S44)<0.01,0.01,STDEV($S$30:S44)))*SQRT(COUNT($S$30:S44))/(2*(COUNT($S$30:S44)-1)))))))","v":{"$error":"#VALUE!"}},{"$f":"IF((MAX(0,(0.5-(($AR$21-AVERAGE($T$30:T44))/(IF(STDEV($T$30:T44)<0.01,0.01,STDEV($T$30:T44)))*SQRT(COUNT($T$30:T44))/(2*(COUNT($T$30:T44)-1))))))>1,1,(MAX(0,(0.5-(($AR$21-AVERAGE($T$30:T44))/(IF(STDEV($T$30:T44)<0.01,0.01,STDEV($T$30:T44)))*SQRT(COUNT($T$30:T44))/(2*(COUNT($T$30:T44)-1)))))))","v":{"$error":"#VALUE!"}},{"$f":"IF((MAX(0,(0.5-(($AS$21-AVERAGE($AA$30:AA44))/(IF(STDEV($AA$30:AA44)<0.01,0.01,STDEV($AA$30:AA44)))*SQRT(COUNT($AA$30:AA44))/(2*(COUNT($AA$30:AA44)-1))))))>1,1,(MAX(0,(0.5-(($AS$21-AVERAGE($AA$30:AA44))/(IF(STDEV($AA$30:AA44)<0.01,0.01,STDEV($AA$30:AA44)))*SQRT(COUNT($AA$30:AA44))/(2*(COUNT($AA$30:AA44)-1)))))))","v":{"$error":"#DIV/0!"}},{"$f":"IF((MAX(0,(0.5-(($AT$21-AVERAGE($AB$30:AB44))/(IF(STDEV($AB$30:AB44)<0.01,0.01,STDEV($AB$30:AB44)))*SQRT(COUNT($AB$30:AB44))/(2*(COUNT($AB$30:AB44)-1))))))>1,1,(MAX(0,(0.5-(($AT$21-AVERAGE($AB$30:AB44))/(IF(STDEV($AB$30:AB44)<0.01,0.01,STDEV($AB$30:AB44)))*SQRT(COUNT($AB$30:AB44))/(2*(COUNT($AB$30:AB44)-1)))))))","v":{"$error":"#DIV/0!"}},null,null,{"$f":"IF((MAX(0,(0.5-((AVERAGE($N$30:N44)-$AW$22)/(IF(STDEV($N$30:N44)<0.01,0.01,STDEV($N$30:N44)))*SQRT(COUNT($N$30:N44))/(2*(COUNT($N$30:N44)-1))))))>1,1,(MAX(0,(0.5-((AVERAGE($N$30:N44)-$AW$22)/(IF(STDEV($N$30:N44)<0.01,0.01,STDEV($N$30:N44)))*SQRT(COUNT($N$30:N44))/(2*(COUNT($N$30:N44)-1)))))))","v":{"$error":"#DIV/0!"}},{"$f":"IF((MAX(0,(0.5-((AVERAGE($S$30:S44)-$AX$22)/(IF(STDEV($S$30:S44)<0.01,0.01,STDEV($S$30:S44)))*SQRT(COUNT($S$30:S44))/(2*(COUNT($S$30:S44)-1))))))>1,1,(MAX(0,(0.5-((AVERAGE($S$30:S44)-$AX$22)/(IF(STDEV($S$30:S44)<0.01,0.01,STDEV($S$30:S44)))*SQRT(COUNT($S$30:S44))/(2*(COUNT($S$30:S44)-1)))))))","v":{"$error":"#DIV/0!"}},{"$f":"IF((MAX(0,(0.5-((AVERAGE($T$30:T44)-$AY$22)/(IF(STDEV($T$30:T44)<0.01,0.01,STDEV($T$30:T44)))*SQRT(COUNT($T$30:T44))/(2*(COUNT($T$30:T44)-1))))))>1,1,(MAX(0,(0.5-((AVERAGE($T$30:T44)-$AY$22)/(IF(STDEV($T$30:T44)<0.01,0.01,STDEV($T$30:T44)))*SQRT(COUNT($T$30:T44))/(2*(COUNT($T$30:T44)-1)))))))","v":{"$error":"#DIV/0!"}},{"$f":"IF((MAX(0,(0.5-((AVERAGE($AA$30:AA44)-$AZ$22)/(IF(STDEV($AA$30:AA44)<0.01,0.01,STDEV($AA$30:AA44)))*SQRT(COUNT($AA$30:AA44))/(2*(COUNT($AA$30:AA44)-1))))))>1,1,(MAX(0,(0.5-((AVERAGE($AA$30:AA44)-$AZ$22)/(IF(STDEV($AA$30:AA44)<0.01,0.01,STDEV($AA$30:AA44)))*SQRT(COUNT($AA$30:AA44))/(2*(COUNT($AA$30:AA44)-1)))))))","v":{"$error":"#DIV/0!"}},{"$f":"IF((MAX(0,(0.5-((AVERAGE($AB$30:AB44)-$BA$22)/(IF(STDEV($AB$30:AB44)<0.01,0.01,STDEV($AB$30:AB44)))*SQRT(COUNT($AB$30:AB44))/(2*(COUNT($AB$30:AB44)-1))))))>1,1,(MAX(0,(0.5-((AVERAGE($AB$30:AB44)-$BA$22)/(IF(STDEV($AB$30:AB44)<0.01,0.01,STDEV($AB$30:AB44)))*SQRT(COUNT($AB$30:AB44))/(2*(COUNT($AB$30:AB44)-1)))))))","v":{"$error":"#DIV/0!"}},null,null,null,{"$f":"(0.5 * ((100-(BETADIST(AL44,((COUNT(N$30:N44))/2)-1,((COUNT(N$30:N44))/2)-1))*100) + (100-(BETADIST(AW44,((COUNT(N$30:N44))/2)-1,((COUNT(N$30:N44))/2)-1))*100) - 100) + 55) / 100","v":{"$error":"#VALUE!"}},{"$f":"(0.5 * ((100-(BETADIST(AQ44,((COUNT(S$30:S44))/2)-1,((COUNT(S$30:S44))/2)-1))*100) + (100-(BETADIST(AX44,((COUNT(S$30:S44))/2)-1,((COUNT(S$30:S44))/2)-1))*100) - 100) + 55) / 100","v":{"$error":"#VALUE!"}},{"$f":"(0.5 * ((100-(BETADIST(AR44,((COUNT(T$30:T44))/2)-1,((COUNT(T$30:T44))/2)-1))*100) + (100-(BETADIST(AY44,((COUNT(T$30:T44))/2)-1,((COUNT(T$30:T44))/2)-1))*100) - 100) + 55) / 100","v":{"$error":"#VALUE!"}},{"$f":"(0.5 * ((100-(BETADIST(AS44,((COUNT(AA$30:AA44))/2)-1,((COUNT(AA$30:AA44))/2)-1))*100) + (100-(BETADIST(AZ44,((COUNT(AA$30:AA44))/2)-1,((COUNT(AA$30:AA44))/2)-1))*100) - 100) + 55) / 100","v":{"$error":"#DIV/0!"}},{"$f":"(0.5 * ((100-(BETADIST(AT44,((COUNT(AB$30:AB44))/2)-1,((COUNT(AB$30:AB44))/2)-1))*100) + (100-(BETADIST(BA44,((COUNT(AB$30:AB44))/2)-1,((COUNT(AB$30:AB44))/2)-1))*100) - 100) + 55) / 100","v":{"$error":"#DIV/0!"}},{"$error":"#VALUE!"}]
[null,null,null,null,null,null,null,null,null,null,null,null,null,null,null,null,null,null,null,null,null,null,null,null,null,null,"","",null,null,0,0,0,0,0,0,0,{"$f":"IF((MAX(0,(0.5-(($AL$21-AVERAGE($N$30:N45))/(IF(STDEV($N$30:N45)<0.01,0.01,STDEV($N$30:N45)))*SQRT(COUNT($N$30:N45))/(2*(COUNT($N$30:N45)-1))))))>1,1,(MAX(0,(0.5-(($AL$21-AVERAGE($N$30:N45))/(IF(STDEV($N$30:N45)<0.01,0.01,STDEV($N$30:N45)))*SQRT(COUNT($N$30:N45))/(2*(COUNT($N$30:N45)-1)))))))","v":{"$error":"#VALUE!"}},0,0,0,0,{"$f":"IF((MAX(0,(0.5-(($AQ$21-AVERAGE($S$30:S45))/(IF(STDEV($S$30:S45)<0.01,0.01,STDEV($S$30:S45)))*SQRT(COUNT($S$30:S45))/(2*(COUNT($S$30:S45)-1))))))>1,1,(MAX(0,(0.5-(($AQ$21-AVERAGE($S$30:S45))/(IF(STDEV($S$30:S45)<0.01,0.01,STDEV($S$30:S45)))*SQRT(COUNT($S$30:S45))/(2*(COUNT($S$30:S45)-1)))))))","v":{"$error":"#VALUE!"}},{"$f":"IF((MAX(0,(0.5-(($AR$21-AVERAGE($T$30:T45))/(IF(STDEV($T$30:T45)<0.01,0.01,STDEV($T$30:T45)))*SQRT(COUNT($T$30:T45))/(2*(COUNT($T$30:T45)-1))))))>1,1,(MAX(0,(0.5-(($AR$21-AVERAGE($T$30:T45))/(IF(STDEV($T$30:T45)<0.01,0.01,STDEV($T$30:T45)))*SQRT(COUNT($T$30:T45))/(2*(COUNT($T$30:T45)-1)))))))","v":{"$error":"#VALUE!"}},{"$f":"IF((MAX(0,(0.5-(($AS$21-AVERAGE($AA$30:AA45))/(IF(STDEV($AA$30:AA45)<0.01,0.01,STDEV($AA$30:AA45)))*SQRT(COUNT($AA$30:AA45))/(2*(COUNT($AA$30:AA45)-1))))))>1,1,(MAX(0,(0.5-(($AS$21-AVERAGE($AA$30:AA45))/(IF(STDEV($AA$30:AA45)<0.01,0.01,STDEV($AA$30:AA45)))*SQRT(COUNT($AA$30:AA45))/(2*(COUNT($AA$30:AA45)-1)))))))","v":{"$error":"#DIV/0!"}},{"$f":"IF((MAX(0,(0.5-(($AT$21-AVERAGE($AB$30:AB45))/(IF(STDEV($AB$30:AB45)<0.01,0.01,STDEV($AB$30:AB45)))*SQRT(COUNT($AB$30:AB45))/(2*(COUNT($AB$30:AB45)-1))))))>1,1,(MAX(0,(0.5-(($AT$21-AVERAGE($AB$30:AB45))/(IF(STDEV($AB$30:AB45)<0.01,0.01,STDEV($AB$30:AB45)))*SQRT(COUNT($AB$30:AB45))/(2*(COUNT($AB$30:AB45)-1)))))))","v":{"$error":"#DIV/0!"}},null,null,{"$f":"IF((MAX(0,(0.5-((AVERAGE($N$30:N45)-$AW$22)/(IF(STDEV($N$30:N45)<0.01,0.01,STDEV($N$30:N45)))*SQRT(COUNT($N$30:N45))/(2*(COUNT($N$30:N45)-1))))))>1,1,(MAX(0,(0.5-((AVERAGE($N$30:N45)-$AW$22)/(IF(STDEV($N$30:N45)<0.01,0.01,STDEV($N$30:N45)))*SQRT(COUNT($N$30:N45))/(2*(COUNT($N$30:N45)-1)))))))","v":{"$error":"#DIV/0!"}},{"$f":"IF((MAX(0,(0.5-((AVERAGE($S$30:S45)-$AX$22)/(IF(STDEV($S$30:S45)<0.01,0.01,STDEV($S$30:S45)))*SQRT(COUNT($S$30:S45))/(2*(COUNT($S$30:S45)-1))))))>1,1,(MAX(0,(0.5-((AVERAGE($S$30:S45)-$AX$22)/(IF(STDEV($S$30:S45)<0.01,0.01,STDEV($S$30:S45)))*SQRT(COUNT($S$30:S45))/(2*(COUNT($S$30:S45)-1)))))))","v":{"$error":"#DIV/0!"}},{"$f":"IF((MAX(0,(0.5-((AVERAGE($T$30:T45)-$AY$22)/(IF(STDEV($T$30:T45)<0.01,0.01,STDEV($T$30:T45)))*SQRT(COUNT($T$30:T45))/(2*(COUNT($T$30:T45)-1))))))>1,1,(MAX(0,(0.5-((AVERAGE($T$30:T45)-$AY$22)/(IF(STDEV($T$30:T45)<0.01,0.01,STDEV($T$30:T45)))*SQRT(COUNT($T$30:T45))/(2*(COUNT($T$30:T45)-1)))))))","v":{"$error":"#DIV/0!"}},{"$f":"IF((MAX(0,(0.5-((AVERAGE($AA$30:AA45)-$AZ$22)/(IF(STDEV($AA$30:AA45)<0.01,0.01,STDEV($AA$30:AA45)))*SQRT(COUNT($AA$30:AA45))/(2*(COUNT($AA$30:AA45)-1))))))>1,1,(MAX(0,(0.5-((AVERAGE($AA$30:AA45)-$AZ$22)/(IF(STDEV($AA$30:AA45)<0.01,0.01,STDEV($AA$30:AA45)))*SQRT(COUNT($AA$30:AA45))/(2*(COUNT($AA$30:AA45)-1)))))))","v":{"$error":"#DIV/0!"}},{"$f":"IF((MAX(0,(0.5-((AVERAGE($AB$30:AB45)-$BA$22)/(IF(STDEV($AB$30:AB45)<0.01,0.01,STDEV($AB$30:AB45)))*SQRT(COUNT($AB$30:AB45))/(2*(COUNT($AB$30:AB45)-1))))))>1,1,(MAX(0,(0.5-((AVERAGE($AB$30:AB45)-$BA$22)/(IF(STDEV($AB$30:AB45)<0.01,0.01,STDEV($AB$30:AB45)))*SQRT(COUNT($AB$30:AB45))/(2*(COUNT($AB$30:AB45)-1)))))))","v":{"$error":"#DIV/0!"}},null,null,null,{"$f":"(0.5 * ((100-(BETADIST(AL45,((COUNT(N$30:N45))/2)-1,((COUNT(N$30:N45))/2)-1))*100) + (100-(BETADIST(AW45,((COUNT(N$30:N45))/2)-1,((COUNT(N$30:N45))/2)-1))*100) - 100) + 55) / 100","v":{"$error":"#VALUE!"}},{"$f":"(0.5 * ((100-(BETADIST(AQ45,((COUNT(S$30:S45))/2)-1,((COUNT(S$30:S45))/2)-1))*100) + (100-(BETADIST(AX45,((COUNT(S$30:S45))/2)-1,((COUNT(S$30:S45))/2)-1))*100) - 100) + 55) / 100","v":{"$error":"#VALUE!"}},{"$f":"(0.5 * ((100-(BETADIST(AR45,((COUNT(T$30:T45))/2)-1,((COUNT(T$30:T45))/2)-1))*100) + (100-(BETADIST(AY45,((COUNT(T$30:T45))/2)-1,((COUNT(T$30:T45))/2)-1))*100) - 100) + 55) / 100","v":{"$error":"#VALUE!"}},{"$f":"(0.5 * ((100-(BETADIST(AS45,((COUNT(AA$30:AA45))/2)-1,((COUNT(AA$30:AA45))/2)-1))*100) + (100-(BETADIST(AZ45,((COUNT(AA$30:AA45))/2)-1,((COUNT(AA$30:AA45))/2)-1))*100) - 100) + 55) / 100","v":{"$error":"#DIV/0!"}},{"$f":"(0.5 * ((100-(BETADIST(AT45,((COUNT(AB$30:AB45))/2)-1,((COUNT(AB$30:AB45))/2)-1))*100) + (100-(BETADIST(BA45,((COUNT(AB$30:AB45))/2)-1,((COUNT(AB$30:AB45))/2)-1))*100) - 100) + 55) / 100","v":{"$error":"#DIV/0!"}},{"$error":"#VALUE!"}]
[null,null,null,null,null,null,null,null,null,null,null,null,null,null,null,null,null,null,null,null,null,null,null,null,null,null,"","",null,null,0,0,0,0,0,0,0,{"$f":"IF((MAX(0,(0.5-(($AL$21-AVERAGE($N$30:N46))/(IF(STDEV($N$30:N46)<0.01,0.01,STDEV($N$30:N46)))*SQRT(COUNT($N$30:N46))/(2*(COUNT($N$30:N46)-1))))))>1,1,(MAX(0,(0.5-(($AL$21-AVERAGE($N$30:N46))/(IF(STDEV($N$30:N46)<0.01,0.01,STDEV($N$30:N46)))*SQRT(COUNT($N$30:N46))/(2*(COUNT($N$30:N46)-1)))))))","v":{"$error":"#VALUE!"}},0,0,0,0,{"$f":"IF((MAX(0,(0.5-(($AQ$21-AVERAGE($S$30:S46))/(IF(STDEV($S$30:S46)<0.01,0.01,STDEV($S$30:S46)))*SQRT(COUNT($S$30:S46))/(2*(COUNT($S$30:S46)-1))))))>1,1,(MAX(0,(0.5-(($AQ$21-AVERAGE($S$30:S46))/(IF(STDEV($S$30:S46)<0.01,0.01,STDEV($S$30:S46)))*SQRT(COUNT($S$30:S46))/(2*(COUNT($S$30:S46)-1)))))))","v":{"$error":"#VALUE!"}},{"$f":"IF((MAX(0,(0.5-(($AR$21-AVERAGE($T$30:T46))/(IF(STDEV($T$30:T46)<0.01,0.01,STDEV($T$30:T46)))*SQRT(COUNT($T$30:T46))/(2*(COUNT($T$30:T46)-1))))))>1,1,(MAX(0,(0.5-(($AR$21-AVERAGE($T$30:T46))/(IF(STDEV($T$30:T46)<0.01,0.01,STDEV($T$30:T46)))*SQRT(COUNT($T$30:T46))/(2*(COUNT($T$30:T46)-1)))))))","v":{"$error":"#VALUE!"}},{"$f":"IF((MAX(0,(0.5-(($AS$21-AVERAGE($AA$30:AA46))/(IF(STDEV($AA$30:AA46)<0.01,0.01,STDEV($AA$30:AA46)))*SQRT(COUNT($AA$30:AA46))/(2*(COUNT($AA$30:AA46)-1))))))>1,1,(MAX(0,(0.5-(($AS$21-AVERAGE($AA$30:AA46))/(IF(STDEV($AA$30:AA46)<0.01,0.01,STDEV($AA$30:AA46)))*SQRT(COUNT($AA$30:AA46))/(2*(COUNT($AA$30:AA46)-1)))))))","v":{"$error":"#DIV/0!"}},{"$f":"IF((MAX(0,(0.5-(($AT$21-AVERAGE($AB$30:AB46))/(IF(STDEV($AB$30:AB46)<0.01,0.01,STDEV($AB$30:AB46)))*SQRT(COUNT($AB$30:AB46))/(2*(COUNT($AB$30:AB46)-1))))))>1,1,(MAX(0,(0.5-(($AT$21-AVERAGE($AB$30:AB46))/(IF(STDEV($AB$30:AB46)<0.01,0.01,STDEV($AB$30:AB46)))*SQRT(COUNT($AB$30:AB46))/(2*(COUNT($AB$30:AB46)-1)))))))","v":{"$error":"#DIV/0!"}},null,null,{"$f":"IF((MAX(0,(0.5-((AVERAGE($N$30:N46)-$AW$22)/(IF(STDEV($N$30:N46)<0.01,0.01,STDEV($N$30:N46)))*SQRT(COUNT($N$30:N46))/(2*(COUNT($N$30:N46)-1))))))>1,1,(MAX(0,(0.5-((AVERAGE($N$30:N46)-$AW$22)/(IF(STDEV($N$30:N46)<0.01,0.01,STDEV($N$30:N46)))*SQRT(COUNT($N$30:N46))/(2*(COUNT($N$30:N46)-1)))))))","v":{"$error":"#DIV/0!"}},{"$f":"IF((MAX(0,(0.5-((AVERAGE($S$30:S46)-$AX$22)/(IF(STDEV($S$30:S46)<0.01,0.01,STDEV($S$30:S46)))*SQRT(COUNT($S$30:S46))/(2*(COUNT($S$30:S46)-1))))))>1,1,(MAX(0,(0.5-((AVERAGE($S$30:S46)-$AX$22)/(IF(STDEV($S$30:S46)<0.01,0.01,STDEV($S$30:S46)))*SQRT(COUNT($S$30:S46))/(2*(COUNT($S$30:S46)-1)))))))","v":{"$error":"#DIV/0!"}},{"$f":"IF((MAX(0,(0.5-((AVERAGE($T$30:T46)-$AY$22)/(IF(STDEV($T$30:T46)<0.01,0.01,STDEV($T$30:T46)))*SQRT(COUNT($T$30:T46))/(2*(COUNT($T$30:T46)-1))))))>1,1,(MAX(0,(0.5-((AVERAGE($T$30:T46)-$AY$22)/(IF(STDEV($T$30:T46)<0.01,0.01,STDEV($T$30:T46)))*SQRT(COUNT($T$30:T46))/(2*(COUNT($T$30:T46)-1)))))))","v":{"$error":"#DIV/0!"}},{"$f":"IF((MAX(0,(0.5-((AVERAGE($AA$30:AA46)-$AZ$22)/(IF(STDEV($AA$30:AA46)<0.01,0.01,STDEV($AA$30:AA46)))*SQRT(COUNT($AA$30:AA46))/(2*(COUNT($AA$30:AA46)-1))))))>1,1,(MAX(0,(0.5-((AVERAGE($AA$30:AA46)-$AZ$22)/(IF(STDEV($AA$30:AA46)<0.01,0.01,STDEV($AA$30:AA46)))*SQRT(COUNT($AA$30:AA46))/(2*(COUNT($AA$30:AA46)-1)))))))","v":{"$error":"#DIV/0!"}},{"$f":"IF((MAX(0,(0.5-((AVERAGE($AB$30:AB46)-$BA$22)/(IF(STDEV($AB$30:AB46)<0.01,0.01,STDEV($AB$30:AB46)))*SQRT(COUNT($AB$30:AB46))/(2*(COUNT($AB$30:AB46)-1))))))>1,1,(MAX(0,(0.5-((AVERAGE($AB$30:AB46)-$BA$22)/(IF(STDEV($AB$30:AB46)<0.01,0.01,STDEV($AB$30:AB46)))*SQRT(COUNT($AB$30:AB46))/(2*(COUNT($AB$30:AB46)-1)))))))","v":{"$error":"#DIV/0!"}},null,null,null,{"$f":"(0.5 * ((100-(BETADIST(AL46,((COUNT(N$30:N46))/2)-1,((COUNT(N$30:N46))/2)-1))*100) + (100-(BETADIST(AW46,((COUNT(N$30:N46))/2)-1,((COUNT(N$30:N46))/2)-1))*100) - 100) + 55) / 100","v":{"$error":"#VALUE!"}},{"$f":"(0.5 * ((100-(BETADIST(AQ46,((COUNT(S$30:S46))/2)-1,((COUNT(S$30:S46))/2)-1))*100) + (100-(BETADIST(AX46,((COUNT(S$30:S46))/2)-1,((COUNT(S$30:S46))/2)-1))*100) - 100) + 55) / 100","v":{"$error":"#VALUE!"}},{"$f":"(0.5 * ((100-(BETADIST(AR46,((COUNT(T$30:T46))/2)-1,((COUNT(T$30:T46))/2)-1))*100) + (100-(BETADIST(AY46,((COUNT(T$30:T46))/2)-1,((COUNT(T$30:T46))/2)-1))*100) - 100) + 55) / 100","v":{"$error":"#VALUE!"}},{"$f":"(0.5 * ((100-(BETADIST(AS46,((COUNT(AA$30:AA46))/2)-1,((COUNT(AA$30:AA46))/2)-1))*100) + (100-(BETADIST(AZ46,((COUNT(AA$30:AA46))/2)-1,((COUNT(AA$30:AA46))/2)-1))*100) - 100) + 55) / 100","v":{"$error":"#DIV/0!"}},{"$f":"(0.5 * ((100-(BETADIST(AT46,((COUNT(AB$30:AB46))/2)-1,((COUNT(AB$30:AB46))/2)-1))*100) + (100-(BETADIST(BA46,((COUNT(AB$30:AB46))/2)-1,((COUNT(AB$30:AB46))/2)-1))*100) - 100) + 55) / 100","v":{"$error":"#DIV/0!"}},{"$error":"#VALUE!"}]
[null,null,null,null,null,null,null,null,null,null,null,null,null,null,null,null,null,null,null,null,null,null,null,null,null,null,"","",null,null,0,0,0,0,0,0,0,{"$f":"IF((MAX(0,(0.5-(($AL$21-AVERAGE($N$30:N47))/(IF(STDEV($N$30:N47)<0.01,0.01,STDEV($N$30:N47)))*SQRT(COUNT($N$30:N47))/(2*(COUNT($N$30:N47)-1))))))>1,1,(MAX(0,(0.5-(($AL$21-AVERAGE($N$30:N47))/(IF(STDEV($N$30:N47)<0.01,0.01,STDEV($N$30:N47)))*SQRT(COUNT($N$30:N47))/(2*(COUNT($N$30:N47)-1)))))))","v":{"$error":"#VALUE!"}},0,0,0,0,{"$f":"IF((MAX(0,(0.5-(($AQ$21-AVERAGE($S$30:S47))/(IF(STDEV($S$30:S47)<0.01,0.01,STDEV($S$30:S47)))*SQRT(COUNT($S$30:S47))/(2*(COUNT($S$30:S47)-1))))))>1,1,(MAX(0,(0.5-(($AQ$21-AVERAGE($S$30:S47))/(IF(STDEV($S$30:S47)<0.01,0.01,STDEV($S$30:S47)))*SQRT(COUNT($S$30:S47))/(2*(COUNT($S$30:S47)-1)))))))","v":{"$error":"#VALUE!"}},{"$f":"IF((MAX(0,(0.5-(($AR$21-AVERAGE($T$30:T47))/(IF(STDEV($T$30:T47)<0.01,0.01,STDEV($T$30:T47)))*SQRT(COUNT($T$30:T47))/(2*(COUNT($T$30:T47)-1))))))>1,1,(MAX(0,(0.5-(($AR$21-AVERAGE($T$30:T47))/(IF(STDEV($T$30:T47)<0.01,0.01,STDEV($T$30:T47)))*SQRT(COUNT($T$30:T47))/(2*(COUNT($T$30:T47)-1)))))))","v":{"$error":"#VALUE!"}},{"$f":"IF((MAX(0,(0.5-(($AS$21-AVERAGE($AA$30:AA47))/(IF(STDEV($AA$30:AA47)<0.01,0.01,STDEV($AA$30:AA47)))*SQRT(COUNT($AA$30:AA47))/(2*(COUNT($AA$30:AA47)-1))))))>1,1,(MAX(0,(0.5-(($AS$21-AVERAGE($AA$30:AA47))/(IF(STDEV($AA$30:AA47)<0.01,0.01,STDEV($AA$30:AA47)))*SQRT(COUNT($AA$30:AA47))/(2*(COUNT($AA$30:AA47)-1)))))))","v":{"$error":"#DIV/0!"}},{"$f":"IF((MAX(0,(0.5-(($AT$21-AVERAGE($AB$30:AB47))/(IF(STDEV($AB$30:AB47)<0.01,0.01,STDEV($AB$30:AB47)))*SQRT(COUNT($AB$30:AB47))/(2*(COUNT($AB$30:AB47)-1))))))>1,1,(MAX(0,(0.5-(($AT$21-AVERAGE($AB$30:AB47))/(IF(STDEV($AB$30:AB47)<0.01,0.01,STDEV($AB$30:AB47)))*SQRT(COUNT($AB$30:AB47))/(2*(COUNT($AB$30:AB47)-1)))))))","v":{"$error":"#DIV/0!"}},null,null,{"$f":"IF((MAX(0,(0.5-((AVERAGE($N$30:N47)-$AW$22)/(IF(STDEV($N$30:N47)<0.01,0.01,STDEV($N$30:N47)))*SQRT(COUNT($N$30:N47))/(2*(COUNT($N$30:N47)-1))))))>1,1,(MAX(0,(0.5-((AVERAGE($N$30:N47)-$AW$22)/(IF(STDEV($N$30:N47)<0.01,0.01,STDEV($N$30:N47)))*SQRT(COUNT($N$30:N47))/(2*(COUNT($N$30:N47)-1)))))))","v":{"$error":"#DIV/0!"}},{"$f":"IF((MAX(0,(0.5-((AVERAGE($S$30:S47)-$AX$22)/(IF(STDEV($S$30:S47)<0.01,0.01,STDEV($S$30:S47)))*SQRT(COUNT($S$30:S47))/(2*(COUNT($S$30:S47)-1))))))>1,1,(MAX(0,(0.5-((AVERAGE($S$30:S47)-$AX$22)/(IF(STDEV($S$30:S47)<0.01,0.01,STDEV($S$30:S47)))*SQRT(COUNT($S$30:S47))/(2*(COUNT($S$30:S47)-1)))))))","v":{"$error":"#DIV/0!"}},{"$f":"IF((MAX(0,(0.5-((AVERAGE($T$30:T47)-$AY$22)/(IF(STDEV($T$30:T47)<0.01,0.01,STDEV($T$30:T47)))*SQRT(COUNT($T$30:T47))/(2*(COUNT($T$30:T47)-1))))))>1,1,(MAX(0,(0.5-((AVERAGE($T$30:T47)-$AY$22)/(IF(STDEV($T$30:T47)<0.01,0.01,STDEV($T$30:T47)))*SQRT(COUNT($T$30:T47))/(2*(COUNT($T$30:T47)-1)))))))","v":{"$error":"#DIV/0!"}},{"$f":"IF((MAX(0,(0.5-((AVERAGE($AA$30:AA47)-$AZ$22)/(IF(STDEV($AA$30:AA47)<0.01,0.01,STDEV($AA$30:AA47)))*SQRT(COUNT($AA$30:AA47))/(2*(COUNT($AA$30:AA47)-1))))))>1,1,(MAX(0,(0.5-((AVERAGE($AA$30:AA47)-$AZ$22)/(IF(STDEV($AA$30:AA47)<0.01,0.01,STDEV($AA$30:AA47)))*SQRT(COUNT($AA$30:AA47))/(2*(COUNT($AA$30:AA47)-1)))))))","v":{"$error":"#DIV/0!"}},{"$f":"IF((MAX(0,(0.5-((AVERAGE($AB$30:AB47)-$BA$22)/(IF(STDEV($AB$30:AB47)<0.01,0.01,STDEV($AB$30:AB47)))*SQRT(COUNT($AB$30:AB47))/(2*(COUNT($AB$30:AB47)-1))))))>1,1,(MAX(0,(0.5-((AVERAGE($AB$30:AB47)-$BA$22)/(IF(STDEV($AB$30:AB47)<0.01,0.01,STDEV($AB$30:AB47)))*SQRT(COUNT($AB$30:AB47))/(2*(COUNT($AB$30:AB47)-1)))))))","v":{"$error":"#DIV/0!"}},null,null,null,{"$f":"(0.5 * ((100-(BETADIST(AL47,((COUNT(N$30:N47))/2)-1,((COUNT(N$30:N47))/2)-1))*100) + (100-(BETADIST(AW47,((COUNT(N$30:N47))/2)-1,((COUNT(N$30:N47))/2)-1))*100) - 100) + 55) / 100","v":{"$error":"#VALUE!"}},{"$f":"(0.5 * ((100-(BETADIST(AQ47,((COUNT(S$30:S47))/2)-1,((COUNT(S$30:S47))/2)-1))*100) + (100-(BETADIST(AX47,((COUNT(S$30:S47))/2)-1,((COUNT(S$30:S47))/2)-1))*100) - 100) + 55) / 100","v":{"$error":"#VALUE!"}},{"$f":"(0.5 * ((100-(BETADIST(AR47,((COUNT(T$30:T47))/2)-1,((COUNT(T$30:T47))/2)-1))*100) + (100-(BETADIST(AY47,((COUNT(T$30:T47))/2)-1,((COUNT(T$30:T47))/2)-1))*100) - 100) + 55) / 100","v":{"$error":"#VALUE!"}},{"$f":"(0.5 * ((100-(BETADIST(AS47,((COUNT(AA$30:AA47))/2)-1,((COUNT(AA$30:AA47))/2)-1))*100) + (100-(BETADIST(AZ47,((COUNT(AA$30:AA47))/2)-1,((COUNT(AA$30:AA47))/2)-1))*100) - 100) + 55) / 100","v":{"$error":"#DIV/0!"}},{"$f":"(0.5 * ((100-(BETADIST(AT47,((COUNT(AB$30:AB47))/2)-1,((COUNT(AB$30:AB47))/2)-1))*100) + (100-(BETADIST(BA47,((COUNT(AB$30:AB47))/2)-1,((COUNT(AB$30:AB47))/2)-1))*100) - 100) + 55) / 100","v":{"$error":"#DIV/0!"}},{"$error":"#VALUE!"}]
[null,null,null,null,null,null,null,null,null,null,null,null,null,null,null,null,null,null,null,null,null,null,null,null,null,null,"","",null,null,0,0,0,0,0,0,0,{"$f":"IF((MAX(0,(0.5-(($AL$21-AVERAGE($N$30:N48))/(IF(STDEV($N$30:N48)<0.01,0.01,STDEV($N$30:N48)))*SQRT(COUNT($N$30:N48))/(2*(COUNT($N$30:N48)-1))))))>1,1,(MAX(0,(0.5-(($AL$21-AVERAGE($N$30:N48))/(IF(STDEV($N$30:N48)<0.01,0.01,STDEV($N$30:N48)))*SQRT(COUNT($N$30:N48))/(2*(COUNT($N$30:N48)-1)))))))","v":{"$error":"#VALUE!"}},0,0,0,0,{"$f":"IF((MAX(0,(0.5-(($AQ$21-AVERAGE($S$30:S48))/(IF(STDEV($S$30:S48)<0.01,0.01,STDEV($S$30:S48)))*SQRT(COUNT($S$30:S48))/(2*(COUNT($S$30:S48)-1))))))>1,1,(MAX(0,(0.5-(($AQ$21-AVERAGE($S$30:S48))/(IF(STDEV($S$30:S48)<0.01,0.01,STDEV($S$30:S48)))*SQRT(COUNT($S$30:S48))/(2*(COUNT($S$30:S48)-1)))))))","v":{"$error":"#VALUE!"}},{"$f":"IF((MAX(0,(0.5-(($AR$21-AVERAGE($T$30:T48))/(IF(STDEV($T$30:T48)<0.01,0.01,STDEV($T$30:T48)))*SQRT(COUNT($T$30:T48))/(2*(COUNT($T$30:T48)-1))))))>1,1,(MAX(0,(0.5-(($AR$21-AVERAGE($T$30:T48))/(IF(STDEV($T$30:T48)<0.01,0.01,STDEV($T$30:T48)))*SQRT(COUNT($T$30:T48))/(2*(COUNT($T$30:T48)-1)))))))","v":{"$error":"#VALUE!"}},{"$f":"IF((MAX(0,(0.5-(($AS$21-AVERAGE($AA$30:AA48))/(IF(STDEV($AA$30:AA48)<0.01,0.01,STDEV($AA$30:AA48)))*SQRT(COUNT($AA$30:AA48))/(2*(COUNT($AA$30:AA48)-1))))))>1,1,(MAX(0,(0.5-(($AS$21-AVERAGE($AA$30:AA48))/(IF(STDEV($AA$30:AA48)<0.01,0.01,STDEV($AA$30:AA48)))*SQRT(COUNT($AA$30:AA48))/(2*(COUNT($AA$30:AA48)-1)))))))","v":{"$error":"#DIV/0!"}},{"$f":"IF((MAX(0,(0.5-(($AT$21-AVERAGE($AB$30:AB48))/(IF(STDEV($AB$30:AB48)<0.01,0.01,STDEV($AB$30:AB48)))*SQRT(COUNT($AB$30:AB48))/(2*(COUNT($AB$30:AB48)-1))))))>1,1,(MAX(0,(0.5-(($AT$21-AVERAGE($AB$30:AB48))/(IF(STDEV($AB$30:AB48)<0.01,0.01,STDEV($AB$30:AB48)))*SQRT(COUNT($AB$30:AB48))/(2*(COUNT($AB$30:AB48)-1)))))))","v":{"$error":"#DIV/0!"}},null,null,{"$f":"IF((MAX(0,(0.5-((AVERAGE($N$30:N48)-$AW$22)/(IF(STDEV($N$30:N48)<0.01,0.01,STDEV($N$30:N48)))*SQRT(COUNT($N$30:N48))/(2*(COUNT($N$30:N48)-1))))))>1,1,(MAX(0,(0.5-((AVERAGE($N$30:N48)-$AW$22)/(IF(STDEV($N$30:N48)<0.01,0.01,STDEV($N$30:N48)))*SQRT(COUNT($N$30:N48))/(2*(COUNT($N$30:N48)-1)))))))","v":{"$error":"#DIV/0!"}},{"$f":"IF((MAX(0,(0.5-((AVERAGE($S$30:S48)-$AX$22)/(IF(STDEV($S$30:S48)<0.01,0.01,STDEV($S$30:S48)))*SQRT(COUNT($S$30:S48))/(2*(COUNT($S$30:S48)-1))))))>1,1,(MAX(0,(0.5-((AVERAGE($S$30:S48)-$AX$22)/(IF(STDEV($S$30:S48)<0.01,0.01,STDEV($S$30:S48)))*SQRT(COUNT($S$30:S48))/(2*(COUNT($S$30:S48)-1)))))))","v":{"$error":"#DIV/0!"}},{"$f":"IF((MAX(0,(0.5-((AVERAGE($T$30:T48)-$AY$22)/(IF(STDEV($T$30:T48)<0.01,0.01,STDEV($T$30:T48)))*SQRT(COUNT($T$30:T48))/(2*(COUNT($T$30:T48)-1))))))>1,1,(MAX(0,(0.5-((AVERAGE($T$30:T48)-$AY$22)/(IF(STDEV($T$30:T48)<0.01,0.01,STDEV($T$30:T48)))*SQRT(COUNT($T$30:T48))/(2*(COUNT($T$30:T48)-1)))))))","v":{"$error":"#DIV/0!"}},{"$f":"IF((MAX(0,(0.5-((AVERAGE($AA$30:AA48)-$AZ$22)/(IF(STDEV($AA$30:AA48)<0.01,0.01,STDEV($AA$30:AA48)))*SQRT(COUNT($AA$30:AA48))/(2*(COUNT($AA$30:AA48)-1))))))>1,1,(MAX(0,(0.5-((AVERAGE($AA$30:AA48)-$AZ$22)/(IF(STDEV($AA$30:AA48)<0.01,0.01,STDEV($AA$30:AA48)))*SQRT(COUNT($AA$30:AA48))/(2*(COUNT($AA$30:AA48)-1)))))))","v":{"$error":"#DIV/0!"}},{"$f":"IF((MAX(0,(0.5-((AVERAGE($AB$30:AB48)-$BA$22)/(IF(STDEV($AB$30:AB48)<0.01,0.01,STDEV($AB$30:AB48)))*SQRT(COUNT($AB$30:AB48))/(2*(COUNT($AB$30:AB48)-1))))))>1,1,(MAX(0,(0.5-((AVERAGE($AB$30:AB48)-$BA$22)/(IF(STDEV($AB$30:AB48)<0.01,0.01,STDEV($AB$30:AB48)))*SQRT(COUNT($AB$30:AB48))/(2*(COUNT($AB$30:AB48)-1)))))))","v":{"$error":"#DIV/0!"}},null,null,null,{"$f":"(0.5 * ((100-(BETADIST(AL48,((COUNT(N$30:N48))/2)-1,((COUNT(N$30:N48))/2)-1))*100) + (100-(BETADIST(AW48,((COUNT(N$30:N48))/2)-1,((COUNT(N$30:N48))/2)-1))*100) - 100) + 55) / 100","v":{"$error":"#VALUE!"}},{"$f":"(0.5 * ((100-(BETADIST(AQ48,((COUNT(S$30:S48))/2)-1,((COUNT(S$30:S48))/2)-1))*100) + (100-(BETADIST(AX48,((COUNT(S$30:S48))/2)-1,((COUNT(S$30:S48))/2)-1))*100) - 100) + 55) / 100","v":{"$error":"#VALUE!"}},{"$f":"(0.5 * ((100-(BETADIST(AR48,((COUNT(T$30:T48))/2)-1,((COUNT(T$30:T48))/2)-1))*100) + (100-(BETADIST(AY48,((COUNT(T$30:T48))/2)-1,((COUNT(T$30:T48))/2)-1))*100) - 100) + 55) / 100","v":{"$error":"#VALUE!"}},{"$f":"(0.5 * ((100-(BETADIST(AS48,((COUNT(AA$30:AA48))/2)-1,((COUNT(AA$30:AA48))/2)-1))*100) + (100-(BETADIST(AZ48,((COUNT(AA$30:AA48))/2)-1,((COUNT(AA$30:AA48))/2)-1))*100) - 100) + 55) / 100","v":{"$error":"#DIV/0!"}},{"$f":"(0.5 * ((100-(BETADIST(AT48,((COUNT(AB$30:AB48))/2)-1,((COUNT(AB$30:AB48))/2)-1))*100) + (100-(BETADIST(BA48,((COUNT(AB$30:AB48))/2)-1,((COUNT(AB$30:AB48))/2)-1))*100) - 100) + 55) / 100","v":{"$error":"#DIV/0!"}},{"$error":"#VALUE!"}]
[null,null,null,null,null,null,null,null,null,null,null,null,null,null,null,null,null,null,null,null,null,null,null,null,null,null,"","",null,null,0,0,0,0,0,0,0,{"$f":"IF((MAX(0,(0.5-(($AL$21-AVERAGE($N$30:N49))/(IF(STDEV($N$30:N49)<0.01,0.01,STDEV($N$30:N49)))*SQRT(COUNT($N$30:N49))/(2*(COUNT($N$30:N49)-1))))))>1,1,(MAX(0,(0.5-(($AL$21-AVERAGE($N$30:N49))/(IF(STDEV($N$30:N49)<0.01,0.01,STDEV($N$30:N49)))*SQRT(COUNT($N$30:N49))/(2*(COUNT($N$30:N49)-1)))))))","v":{"$error":"#VALUE!"}},0,0,0,0,{"$f":"IF((MAX(0,(0.5-(($AQ$21-AVERAGE($S$30:S49))/(IF(STDEV($S$30:S49)<0.01,0.01,STDEV($S$30:S49)))*SQRT(COUNT($S$30:S49))/(2*(COUNT($S$30:S49)-1))))))>1,1,(MAX(0,(0.5-(($AQ$21-AVERAGE($S$30:S49))/(IF(STDEV($S$30:S49)<0.01,0.01,STDEV($S$30:S49)))*SQRT(COUNT($S$30:S49))/(2*(COUNT($S$30:S49)-1)))))))","v":{"$error":"#VALUE!"}},{"$f":"IF((MAX(0,(0.5-(($AR$21-AVERAGE($T$30:T49))/(IF(STDEV($T$30:T49)<0.01,0.01,STDEV($T$30:T49)))*SQRT(COUNT($T$30:T49))/(2*(COUNT($T$30:T49)-1))))))>1,1,(MAX(0,(0.5-(($AR$21-AVERAGE($T$30:T49))/(IF(STDEV($T$30:T49)<0.01,0.01,STDEV($T$30:T49)))*SQRT(COUNT($T$30:T49))/(2*(COUNT($T$30:T49)-1)))))))","v":{"$error":"#VALUE!"}},{"$f":"IF((MAX(0,(0.5-(($AS$21-AVERAGE($AA$30:AA49))/(IF(STDEV($AA$30:AA49)<0.01,0.01,STDEV($AA$30:AA49)))*SQRT(COUNT($AA$30:AA49))/(2*(COUNT($AA$30:AA49)-1))))))>1,1,(MAX(0,(0.5-(($AS$21-AVERAGE($AA$30:AA49))/(IF(STDEV($AA$30:AA49)<0.01,0.01,STDEV($AA$30:AA49)))*SQRT(COUNT($AA$30:AA49))/(2*(COUNT($AA$30:AA49)-1)))))))","v":{"$error":"#DIV/0!"}},{"$f":"IF((MAX(0,(0.5-(($AT$21-AVERAGE($AB$30:AB49))/(IF(STDEV($AB$30:AB49)<0.01,0.01,STDEV($AB$30:AB49)))*SQRT(COUNT($AB$30:AB49))/(2*(COUNT($AB$30:AB49)-1))))))>1,1,(MAX(0,(0.5-(($AT$21-AVERAGE($AB$30:AB49))/(IF(STDEV($AB$30:AB49)<0.01,0.01,STDEV($AB$30:AB49)))*SQRT(COUNT($AB$30:AB49))/(2*(COUNT($AB$30:AB49)-1)))))))","v":{"$error":"#DIV/0!"}},null,null,{"$f":"IF((MAX(0,(0.5-((AVERAGE($N$30:N49)-$AW$22)/(IF(STDEV($N$30:N49)<0.01,0.01,STDEV($N$30:N49)))*SQRT(COUNT($N$30:N49))/(2*(COUNT($N$30:N49)-1))))))>1,1,(MAX(0,(0.5-((AVERAGE($N$30:N49)-$AW$22)/(IF(STDEV($N$30:N49)<0.01,0.01,STDEV($N$30:N49)))*SQRT(COUNT($N$30:N49))/(2*(COUNT($N$30:N49)-1)))))))","v":{"$error":"#DIV/0!"}},{"$f":"IF((MAX(0,(0.5-((AVERAGE($S$30:S49)-$AX$22)/(IF(STDEV($S$30:S49)<0.01,0.01,STDEV($S$30:S49)))*SQRT(COUNT($S$30:S49))/(2*(COUNT($S$30:S49)-1))))))>1,1,(MAX(0,(0.5-((AVERAGE($S$30:S49)-$AX$22)/(IF(STDEV($S$30:S49)<0.01,0.01,STDEV($S$30:S49)))*SQRT(COUNT($S$30:S49))/(2*(COUNT($S$30:S49)-1)))))))","v":{"$error":"#DIV/0!"}},{"$f":"IF((MAX(0,(0.5-((AVERAGE($T$30:T49)-$AY$22)/(IF(STDEV($T$30:T49)<0.01,0.01,STDEV($T$30:T49)))*SQRT(COUNT($T$30:T49))/(2*(COUNT($T$30:T49)-1))))))>1,1,(MAX(0,(0.5-((AVERAGE($T$30:T49)-$AY$22)/(IF(STDEV($T$30:T49)<0.01,0.01,STDEV($T$30:T49)))*SQRT(COUNT($T$30:T49))/(2*(COUNT($T$30:T49)-1)))))))","v":{"$error":"#DIV/0!"}},{"$f":"IF((MAX(0,(0.5-((AVERAGE($AA$30:AA49)-$AZ$22)/(IF(STDEV($AA$30:AA49)<0.01,0.01,STDEV($AA$30:AA49)))*SQRT(COUNT($AA$30:AA49))/(2*(COUNT($AA$30:AA49)-1))))))>1,1,(MAX(0,(0.5-((AVERAGE($AA$30:AA49)-$AZ$22)/(IF(STDEV($AA$30:AA49)<0.01,0.01,STDEV($AA$30:AA49)))*SQRT(COUNT($AA$30:AA49))/(2*(COUNT($AA$30:AA49)-1)))))))","v":{"$error":"#DIV/0!"}},{"$f":"IF((MAX(0,(0.5-((AVERAGE($AB$30:AB49)-$BA$22)/(IF(STDEV($AB$30:AB49)<0.01,0.01,STDEV($AB$30:AB49)))*SQRT(COUNT($AB$30:AB49))/(2*(COUNT($AB$30:AB49)-1))))))>1,1,(MAX(0,(0.5-((AVERAGE($AB$30:AB49)-$BA$22)/(IF(STDEV($AB$30:AB49)<0.01,0.01,STDEV($AB$30:AB49)))*SQRT(COUNT($AB$30:AB49))/(2*(COUNT($AB$30:AB49)-1)))))))","v":{"$error":"#DIV/0!"}},null,null,null,{"$f":"(0.5 * ((100-(BETADIST(AL49,((COUNT(N$30:N49))/2)-1,((COUNT(N$30:N49))/2)-1))*100) + (100-(BETADIST(AW49,((COUNT(N$30:N49))/2)-1,((COUNT(N$30:N49))/2)-1))*100) - 100) + 55) / 100","v":{"$error":"#VALUE!"}},{"$f":"(0.5 * ((100-(BETADIST(AQ49,((COUNT(S$30:S49))/2)-1,((COUNT(S$30:S49))/2)-1))*100) + (100-(BETADIST(AX49,((COUNT(S$30:S49))/2)-1,((COUNT(S$30:S49))/2)-1))*100) - 100) + 55) / 100","v":{"$error":"#VALUE!"}},{"$f":"(0.5 * ((100-(BETADIST(AR49,((COUNT(T$30:T49))/2)-1,((COUNT(T$30:T49))/2)-1))*100) + (100-(BETADIST(AY49,((COUNT(T$30:T49))/2)-1,((COUNT(T$30:T49))/2)-1))*100) - 100) + 55) / 100","v":{"$error":"#VALUE!"}},{"$f":"(0.5 * ((100-(BETADIST(AS49,((COUNT(AA$30:AA49))/2)-1,((COUNT(AA$30:AA49))/2)-1))*100) + (100-(BETADIST(AZ49,((COUNT(AA$30:AA49))/2)-1,((COUNT(AA$30:AA49))/2)-1))*100) - 100) + 55) / 100","v":{"$error":"#DIV/0!"}},{"$f":"(0.5 * ((100-(BETADIST(AT49,((COUNT(AB$30:AB49))/2)-1,((COUNT(AB$30:AB49))/2)-1))*100) + (100-(BETADIST(BA49,((COUNT(AB$30:AB49))/2)-1,((COUNT(AB$30:AB49))/2)-1))*100) - 100) + 55) / 100","v":{"$error":"#DIV/0!"}},{"$error":"#VALUE!"}]
[null,null,null,null,null,null,null,null,null,null,null,null,null,null,null,null,null,null,null,null,null,null,null,null,null,null,"","",null,null,0,0,0,0,0,0,0,{"$f":"IF((MAX(0,(0.5-(($AL$21-AVERAGE($N$30:N50))/(IF(STDEV($N$30:N50)<0.01,0.01,STDEV($N$30:N50)))*SQRT(COUNT($N$30:N50))/(2*(COUNT($N$30:N50)-1))))))>1,1,(MAX(0,(0.5-(($AL$21-AVERAGE($N$30:N50))/(IF(STDEV($N$30:N50)<0.01,0.01,STDEV($N$30:N50)))*SQRT(COUNT($N$30:N50))/(2*(COUNT($N$30:N50)-1)))))))","v":{"$error":"#VALUE!"}},0,0,0,0,{"$f":"IF((MAX(0,(0.5-(($AQ$21-AVERAGE($S$30:S50))/(IF(STDEV($S$30:S50)<0.01,0.01,STDEV($S$30:S50)))*SQRT(COUNT($S$30:S50))/(2*(COUNT($S$30:S50)-1))))))>1,1,(MAX(0,(0.5-(($AQ$21-AVERAGE($S$30:S50))/(IF(STDEV($S$30:S50)<0.01,0.01,STDEV($S$30:S50)))*SQRT(COUNT($S$30:S50))/(2*(COUNT($S$30:S50)-1)))))))","v":{"$error":"#VALUE!"}},{"$f":"IF((MAX(0,(0.5-(($AR$21-AVERAGE($T$30:T50))/(IF(STDEV($T$30:T50)<0.01,0.01,STDEV($T$30:T50)))*SQRT(COUNT($T$30:T50))/(2*(COUNT($T$30:T50)-1))))))>1,1,(MAX(0,(0.5-(($AR$21-AVERAGE($T$30:T50))/(IF(STDEV($T$30:T50)<0.01,0.01,STDEV($T$30:T50)))*SQRT(COUNT($T$30:T50))/(2*(COUNT($T$30:T50)-1)))))))","v":{"$error":"#VALUE!"}},{"$f":"IF((MAX(0,(0.5-(($AS$21-AVERAGE($AA$30:AA50))/(IF(STDEV($AA$30:AA50)<0.01,0.01,STDEV($AA$30:AA50)))*SQRT(COUNT($AA$30:AA50))/(2*(COUNT($AA$30:AA50)-1))))))>1,1,(MAX(0,(0.5-(($AS$21-AVERAGE($AA$30:AA50))/(IF(STDEV($AA$30:AA50)<0.01,0.01,STDEV($AA$30:AA50)))*SQRT(COUNT($AA$30:AA50))/(2*(COUNT($AA$30:AA50)-1)))))))","v":{"$error":"#DIV/0!"}},{"$f":"IF((MAX(0,(0.5-(($AT$21-AVERAGE($AB$30:AB50))/(IF(STDEV($AB$30:AB50)<0.01,0.01,STDEV($AB$30:AB50)))*SQRT(COUNT($AB$30:AB50))/(2*(COUNT($AB$30:AB50)-1))))))>1,1,(MAX(0,(0.5-(($AT$21-AVERAGE($AB$30:AB50))/(IF(STDEV($AB$30:AB50)<0.01,0.01,STDEV($AB$30:AB50)))*SQRT(COUNT($AB$30:AB50))/(2*(COUNT($AB$30:AB50)-1)))))))","v":{"$error":"#DIV/0!"}},null,null,{"$f":"IF((MAX(0,(0.5-((AVERAGE($N$30:N50)-$AW$22)/(IF(STDEV($N$30:N50)<0.01,0.01,STDEV($N$30:N50)))*SQRT(COUNT($N$30:N50))/(2*(COUNT($N$30:N50)-1))))))>1,1,(MAX(0,(0.5-((AVERAGE($N$30:N50)-$AW$22)/(IF(STDEV($N$30:N50)<0.01,0.01,STDEV($N$30:N50)))*SQRT(COUNT($N$30:N50))/(2*(COUNT($N$30:N50)-1)))))))","v":{"$error":"#DIV/0!"}},{"$f":"IF((MAX(0,(0.5-((AVERAGE($S$30:S50)-$AX$22)/(IF(STDEV($S$30:S50)<0.01,0.01,STDEV($S$30:S50)))*SQRT(COUNT($S$30:S50))/(2*(COUNT($S$30:S50)-1))))))>1,1,(MAX(0,(0.5-((AVERAGE($S$30:S50)-$AX$22)/(IF(STDEV($S$30:S50)<0.01,0.01,STDEV($S$30:S50)))*SQRT(COUNT($S$30:S50))/(2*(COUNT($S$30:S50)-1)))))))","v":{"$error":"#DIV/0!"}},{"$f":"IF((MAX(0,(0.5-((AVERAGE($T$30:T50)-$AY$22)/(IF(STDEV($T$30:T50)<0.01,0.01,STDEV($T$30:T50)))*SQRT(COUNT($T$30:T50))/(2*(COUNT($T$30:T50)-1))))))>1,1,(MAX(0,(0.5-((AVERAGE($T$30:T50)-$AY$22)/(IF(STDEV($T$30:T50)<0.01,0.01,STDEV($T$30:T50)))*SQRT(COUNT($T$30:T50))/(2*(COUNT($T$30:T50)-1)))))))","v":{"$error":"#DIV/0!"}},{"$f":"IF((MAX(0,(0.5-((AVERAGE($AA$30:AA50)-$AZ$22)/(IF(STDEV($AA$30:AA50)<0.01,0.01,STDEV($AA$30:AA50)))*SQRT(COUNT($AA$30:AA50))/(2*(COUNT($AA$30:AA50)-1))))))>1,1,(MAX(0,(0.5-((AVERAGE($AA$30:AA50)-$AZ$22)/(IF(STDEV($AA$30:AA50)<0.01,0.01,STDEV($AA$30:AA50)))*SQRT(COUNT($AA$30:AA50))/(2*(COUNT($AA$30:AA50)-1)))))))","v":{"$error":"#DIV/0!"}},{"$f":"IF((MAX(0,(0.5-((AVERAGE($AB$30:AB50)-$BA$22)/(IF(STDEV($AB$30:AB50)<0.01,0.01,STDEV($AB$30:AB50)))*SQRT(COUNT($AB$30:AB50))/(2*(COUNT($AB$30:AB50)-1))))))>1,1,(MAX(0,(0.5-((AVERAGE($AB$30:AB50)-$BA$22)/(IF(STDEV($AB$30:AB50)<0.01,0.01,STDEV($AB$30:AB50)))*SQRT(COUNT($AB$30:AB50))/(2*(COUNT($AB$30:AB50)-1)))))))","v":{"$error":"#DIV/0!"}},null,null,null,{"$f":"(0.5 * ((100-(BETADIST(AL50,((COUNT(N$30:N50))/2)-1,((COUNT(N$30:N50))/2)-1))*100) + (100-(BETADIST(AW50,((COUNT(N$30:N50))/2)-1,((COUNT(N$30:N50))/2)-1))*100) - 100) + 55) / 100","v":{"$error":"#VALUE!"}},{"$f":"(0.5 * ((100-(BETADIST(AQ50,((COUNT(S$30:S50))/2)-1,((COUNT(S$30:S50))/2)-1))*100) + (100-(BETADIST(AX50,((COUNT(S$30:S50))/2)-1,((COUNT(S$30:S50))/2)-1))*100) - 100) + 55) / 100","v":{"$error":"#VALUE!"}},{"$f":"(0.5 * ((100-(BETADIST(AR50,((COUNT(T$30:T50))/2)-1,((COUNT(T$30:T50))/2)-1))*100) + (100-(BETADIST(AY50,((COUNT(T$30:T50))/2)-1,((COUNT(T$30:T50))/2)-1))*100) - 100) + 55) / 100","v":{"$error":"#VALUE!"}},{"$f":"(0.5 * ((100-(BETADIST(AS50,((COUNT(AA$30:AA50))/2)-1,((COUNT(AA$30:AA50))/2)-1))*100) + (100-(BETADIST(AZ50,((COUNT(AA$30:AA50))/2)-1,((COUNT(AA$30:AA50))/2)-1))*100) - 100) + 55) / 100","v":{"$error":"#DIV/0!"}},{"$f":"(0.5 * ((100-(BETADIST(AT50,((COUNT(AB$30:AB50))/2)-1,((COUNT(AB$30:AB50))/2)-1))*100) + (100-(BETADIST(BA50,((COUNT(AB$30:AB50))/2)-1,((COUNT(AB$30:AB50))/2)-1))*100) - 100) + 55) / 100","v":{"$error":"#DIV/0!"}},{"$error":"#VALUE!"}]
[null,null,null,null,null,null,null,null,null,null,null,null,null,null,null,null,null,null,null,null,null,null,null,null,null,null,"","",null,null,0,0,0,0,0,0,0,{"$f":"IF((MAX(0,(0.5-(($AL$21-AVERAGE($N$30:N51))/(IF(STDEV($N$30:N51)<0.01,0.01,STDEV($N$30:N51)))*SQRT(COUNT($N$30:N51))/(2*(COUNT($N$30:N51)-1))))))>1,1,(MAX(0,(0.5-(($AL$21-AVERAGE($N$30:N51))/(IF(STDEV($N$30:N51)<0.01,0.01,STDEV($N$30:N51)))*SQRT(COUNT($N$30:N51))/(2*(COUNT($N$30:N51)-1)))))))","v":{"$error":"#VALUE!"}},0,0,0,0,{"$f":"IF((MAX(0,(0.5-(($AQ$21-AVERAGE($S$30:S51))/(IF(STDEV($S$30:S51)<0.01,0.01,STDEV($S$30:S51)))*SQRT(COUNT($S$30:S51))/(2*(COUNT($S$30:S51)-1))))))>1,1,(MAX(0,(0.5-(($AQ$21-AVERAGE($S$30:S51))/(IF(STDEV($S$30:S51)<0.01,0.01,STDEV($S$30:S51)))*SQRT(COUNT($S$30:S51))/(2*(COUNT($S$30:S51)-1)))))))","v":{"$error":"#VALUE!"}},{"$f":"IF((MAX(0,(0.5-(($AR$21-AVERAGE($T$30:T51))/(IF(STDEV($T$30:T51)<0.01,0.01,STDEV($T$30:T51)))*SQRT(COUNT($T$30:T51))/(2*(COUNT($T$30:T51)-1))))))>1,1,(MAX(0,(0.5-(($AR$21-AVERAGE($T$30:T51))/(IF(STDEV($T$30:T51)<0.01,0.01,STDEV($T$30:T51)))*SQRT(COUNT($T$30:T51))/(2*(COUNT($T$30:T51)-1)))))))","v":{"$error":"#VALUE!"}},{"$f":"IF((MAX(0,(0.5-(($AS$21-AVERAGE($AA$30:AA51))/(IF(STDEV($AA$30:AA51)<0.01,0.01,STDEV($AA$30:AA51)))*SQRT(COUNT($AA$30:AA51))/(2*(COUNT($AA$30:AA51)-1))))))>1,1,(MAX(0,(0.5-(($AS$21-AVERAGE($AA$30:AA51))/(IF(STDEV($AA$30:AA51)<0.01,0.01,STDEV($AA$30:AA51)))*SQRT(COUNT($AA$30:AA51))/(2*(COUNT($AA$30:AA51)-1)))))))","v":{"$error":"#DIV/0!"}},{"$f":"IF((MAX(0,(0.5-(($AT$21-AVERAGE($AB$30:AB51))/(IF(STDEV($AB$30:AB51)<0.01,0.01,STDEV($AB$30:AB51)))*SQRT(COUNT($AB$30:AB51))/(2*(COUNT($AB$30:AB51)-1))))))>1,1,(MAX(0,(0.5-(($AT$21-AVERAGE($AB$30:AB51))/(IF(STDEV($AB$30:AB51)<0.01,0.01,STDEV($AB$30:AB51)))*SQRT(COUNT($AB$30:AB51))/(2*(COUNT($AB$30:AB51)-1)))))))","v":{"$error":"#DIV/0!"}},null,null,{"$f":"IF((MAX(0,(0.5-((AVERAGE($N$30:N51)-$AW$22)/(IF(STDEV($N$30:N51)<0.01,0.01,STDEV($N$30:N51)))*SQRT(COUNT($N$30:N51))/(2*(COUNT($N$30:N51)-1))))))>1,1,(MAX(0,(0.5-((AVERAGE($N$30:N51)-$AW$22)/(IF(STDEV($N$30:N51)<0.01,0.01,STDEV($N$30:N51)))*SQRT(COUNT($N$30:N51))/(2*(COUNT($N$30:N51)-1)))))))","v":{"$error":"#DIV/0!"}},{"$f":"IF((MAX(0,(0.5-((AVERAGE($S$30:S51)-$AX$22)/(IF(STDEV($S$30:S51)<0.01,0.01,STDEV($S$30:S51)))*SQRT(COUNT($S$30:S51))/(2*(COUNT($S$30:S51)-1))))))>1,1,(MAX(0,(0.5-((AVERAGE($S$30:S51)-$AX$22)/(IF(STDEV($S$30:S51)<0.01,0.01,STDEV($S$30:S51)))*SQRT(COUNT($S$30:S51))/(2*(COUNT($S$30:S51)-1)))))))","v":{"$error":"#DIV/0!"}},{"$f":"IF((MAX(0,(0.5-((AVERAGE($T$30:T51)-$AY$22)/(IF(STDEV($T$30:T51)<0.01,0.01,STDEV($T$30:T51)))*SQRT(COUNT($T$30:T51))/(2*(COUNT($T$30:T51)-1))))))>1,1,(MAX(0,(0.5-((AVERAGE($T$30:T51)-$AY$22)/(IF(STDEV($T$30:T51)<0.01,0.01,STDEV($T$30:T51)))*SQRT(COUNT($T$30:T51))/(2*(COUNT($T$30:T51)-1)))))))","v":{"$error":"#DIV/0!"}},{"$f":"IF((MAX(0,(0.5-((AVERAGE($AA$30:AA51)-$AZ$22)/(IF(STDEV($AA$30:AA51)<0.01,0.01,STDEV($AA$30:AA51)))*SQRT(COUNT($AA$30:AA51))/(2*(COUNT($AA$30:AA51)-1))))))>1,1,(MAX(0,(0.5-((AVERAGE($AA$30:AA51)-$AZ$22)/(IF(STDEV($AA$30:AA51)<0.01,0.01,STDEV($AA$30:AA51)))*SQRT(COUNT($AA$30:AA51))/(2*(COUNT($AA$30:AA51)-1)))))))","v":{"$error":"#DIV/0!"}},{"$f":"IF((MAX(0,(0.5-((AVERAGE($AB$30:AB51)-$BA$22)/(IF(STDEV($AB$30:AB51)<0.01,0.01,STDEV($AB$30:AB51)))*SQRT(COUNT($AB$30:AB51))/(2*(COUNT($AB$30:AB51)-1))))))>1,1,(MAX(0,(0.5-((AVERAGE($AB$30:AB51)-$BA$22)/(IF(STDEV($AB$30:AB51)<0.01,0.01,STDEV($AB$30:AB51)))*SQRT(COUNT($AB$30:AB51))/(2*(COUNT($AB$30:AB51)-1)))))))","v":{"$error":"#DIV/0!"}},null,null,null,{"$f":"(0.5 * ((100-(BETADIST(AL51,((COUNT(N$30:N51))/2)-1,((COUNT(N$30:N51))/2)-1))*100) + (100-(BETADIST(AW51,((COUNT(N$30:N51))/2)-1,((COUNT(N$30:N51))/2)-1))*100) - 100) + 55) / 100","v":{"$error":"#VALUE!"}},{"$f":"(0.5 * ((100-(BETADIST(AQ51,((COUNT(S$30:S51))/2)-1,((COUNT(S$30:S51))/2)-1))*100) + (100-(BETADIST(AX51,((COUNT(S$30:S51))/2)-1,((COUNT(S$30:S51))/2)-1))*100) - 100) + 55) / 100","v":{"$error":"#VALUE!"}},{"$f":"(0.5 * ((100-(BETADIST(AR51,((COUNT(T$30:T51))/2)-1,((COUNT(T$30:T51))/2)-1))*100) + (100-(BETADIST(AY51,((COUNT(T$30:T51))/2)-1,((COUNT(T$30:T51))/2)-1))*100) - 100) + 55) / 100","v":{"$error":"#VALUE!"}},{"$f":"(0.5 * ((100-(BETADIST(AS51,((COUNT(AA$30:AA51))/2)-1,((COUNT(AA$30:AA51))/2)-1))*100) + (100-(BETADIST(AZ51,((COUNT(AA$30:AA51))/2)-1,((COUNT(AA$30:AA51))/2)-1))*100) - 100) + 55) / 100","v":{"$error":"#DIV/0!"}},{"$f":"(0.5 * ((100-(BETADIST(AT51,((COUNT(AB$30:AB51))/2)-1,((COUNT(AB$30:AB51))/2)-1))*100) + (100-(BETADIST(BA51,((COUNT(AB$30:AB51))/2)-1,((COUNT(AB$30:AB51))/2)-1))*100) - 100) + 55) / 100","v":{"$error":"#DIV/0!"}},{"$error":"#VALUE!"}]
[null,null,null,null,null,null,null,null,null,null,null,null,null,null,null,null,null,null,null,null,null,null,null,null,null,null,"","",null,null,0,0,0,0,0,0,0,{"$f":"IF((MAX(0,(0.5-(($AL$21-AVERAGE($N$30:N52))/(IF(STDEV($N$30:N52)<0.01,0.01,STDEV($N$30:N52)))*SQRT(COUNT($N$30:N52))/(2*(COUNT($N$30:N52)-1))))))>1,1,(MAX(0,(0.5-(($AL$21-AVERAGE($N$30:N52))/(IF(STDEV($N$30:N52)<0.01,0.01,STDEV($N$30:N52)))*SQRT(COUNT($N$30:N52))/(2*(COUNT($N$30:N52)-1)))))))","v":{"$error":"#VALUE!"}},0,0,0,0,{"$f":"IF((MAX(0,(0.5-(($AQ$21-AVERAGE($S$30:S52))/(IF(STDEV($S$30:S52)<0.01,0.01,STDEV($S$30:S52)))*SQRT(COUNT($S$30:S52))/(2*(COUNT($S$30:S52)-1))))))>1,1,(MAX(0,(0.5-(($AQ$21-AVERAGE($S$30:S52))/(IF(STDEV($S$30:S52)<0.01,0.01,STDEV($S$30:S52)))*SQRT(COUNT($S$30:S52))/(2*(COUNT($S$30:S52)-1)))))))","v":{"$error":"#VALUE!"}},{"$f":"IF((MAX(0,(0.5-(($AR$21-AVERAGE($T$30:T52))/(IF(STDEV($T$30:T52)<0.01,0.01,STDEV($T$30:T52)))*SQRT(COUNT($T$30:T52))/(2*(COUNT($T$30:T52)-1))))))>1,1,(MAX(0,(0.5-(($AR$21-AVERAGE($T$30:T52))/(IF(STDEV($T$30:T52)<0.01,0.01,STDEV($T$30:T52)))*SQRT(COUNT($T$30:T52))/(2*(COUNT($T$30:T52)-1)))))))","v":{"$error":"#VALUE!"}},{"$f":"IF((MAX(0,(0.5-(($AS$21-AVERAGE($AA$30:AA52))/(IF(STDEV($AA$30:AA52)<0.01,0.01,STDEV($AA$30:AA52)))*SQRT(COUNT($AA$30:AA52))/(2*(COUNT($AA$30:AA52)-1))))))>1,1,(MAX(0,(0.5-(($AS$21-AVERAGE($AA$30:AA52))/(IF(STDEV($AA$30:AA52)<0.01,0.01,STDEV($AA$30:AA52)))*SQRT(COUNT($AA$30:AA52))/(2*(COUNT($AA$30:AA52)-1)))))))","v":{"$error":"#DIV/0!"}},{"$f":"IF((MAX(0,(0.5-(($AT$21-AVERAGE($AB$30:AB52))/(IF(STDEV($AB$30:AB52)<0.01,0.01,STDEV($AB$30:AB52)))*SQRT(COUNT($AB$30:AB52))/(2*(COUNT($AB$30:AB52)-1))))))>1,1,(MAX(0,(0.5-(($AT$21-AVERAGE($AB$30:AB52))/(IF(STDEV($AB$30:AB52)<0.01,0.01,STDEV($AB$30:AB52)))*SQRT(COUNT($AB$30:AB52))/(2*(COUNT($AB$30:AB52)-1)))))))","v":{"$error":"#DIV/0!"}},null,null,{"$f":"IF((MAX(0,(0.5-((AVERAGE($N$30:N52)-$AW$22)/(IF(STDEV($N$30:N52)<0.01,0.01,STDEV($N$30:N52)))*SQRT(COUNT($N$30:N52))/(2*(COUNT($N$30:N52)-1))))))>1,1,(MAX(0,(0.5-((AVERAGE($N$30:N52)-$AW$22)/(IF(STDEV($N$30:N52)<0.01,0.01,STDEV($N$30:N52)))*SQRT(COUNT($N$30:N52))/(2*(COUNT($N$30:N52)-1)))))))","v":{"$error":"#DIV/0!"}},{"$f":"IF((MAX(0,(0.5-((AVERAGE($S$30:S52)-$AX$22)/(IF(STDEV($S$30:S52)<0.01,0.01,STDEV($S$30:S52)))*SQRT(COUNT($S$30:S52))/(2*(COUNT($S$30:S52)-1))))))>1,1,(MAX(0,(0.5-((AVERAGE($S$30:S52)-$AX$22)/(IF(STDEV($S$30:S52)<0.01,0.01,STDEV($S$30:S52)))*SQRT(COUNT($S$30:S52))/(2*(COUNT($S$30:S52)-1)))))))","v":{"$error":"#DIV/0!"}},{"$f":"IF((MAX(0,(0.5-((AVERAGE($T$30:T52)-$AY$22)/(IF(STDEV($T$30:T52)<0.01,0.01,STDEV($T$30:T52)))*SQRT(COUNT($T$30:T52))/(2*(COUNT($T$30:T52)-1))))))>1,1,(MAX(0,(0.5-((AVERAGE($T$30:T52)-$AY$22)/(IF(STDEV($T$30:T52)<0.01,0.01,STDEV($T$30:T52)))*SQRT(COUNT($T$30:T52))/(2*(COUNT($T$30:T52)-1)))))))","v":{"$error":"#DIV/0!"}},{"$f":"IF((MAX(0,(0.5-((AVERAGE($AA$30:AA52)-$AZ$22)/(IF(STDEV($AA$30:AA52)<0.01,0.01,STDEV($AA$30:AA52)))*SQRT(COUNT($AA$30:AA52))/(2*(COUNT($AA$30:AA52)-1))))))>1,1,(MAX(0,(0.5-((AVERAGE($AA$30:AA52)-$AZ$22)/(IF(STDEV($AA$30:AA52)<0.01,0.01,STDEV($AA$30:AA52)))*SQRT(COUNT($AA$30:AA52))/(2*(COUNT($AA$30:AA52)-1)))))))","v":{"$error":"#DIV/0!"}},{"$f":"IF((MAX(0,(0.5-((AVERAGE($AB$30:AB52)-$BA$22)/(IF(STDEV($AB$30:AB52)<0.01,0.01,STDEV($AB$30:AB52)))*SQRT(COUNT($AB$30:AB52))/(2*(COUNT($AB$30:AB52)-1))))))>1,1,(MAX(0,(0.5-((AVERAGE($AB$30:AB52)-$BA$22)/(IF(STDEV($AB$30:AB52)<0.01,0.01,STDEV($AB$30:AB52)))*SQRT(COUNT($AB$30:AB52))/(2*(COUNT($AB$30:AB52)-1)))))))","v":{"$error":"#DIV/0!"}},null,null,null,{"$f":"(0.5 * ((100-(BETADIST(AL52,((COUNT(N$30:N52))/2)-1,((COUNT(N$30:N52))/2)-1))*100) + (100-(BETADIST(AW52,((COUNT(N$30:N52))/2)-1,((COUNT(N$30:N52))/2)-1))*100) - 100) + 55) / 100","v":{"$error":"#VALUE!"}},{"$f":"(0.5 * ((100-(BETADIST(AQ52,((COUNT(S$30:S52))/2)-1,((COUNT(S$30:S52))/2)-1))*100) + (100-(BETADIST(AX52,((COUNT(S$30:S52))/2)-1,((COUNT(S$30:S52))/2)-1))*100) - 100) + 55) / 100","v":{"$error":"#VALUE!"}},{"$f":"(0.5 * ((100-(BETADIST(AR52,((COUNT(T$30:T52))/2)-1,((COUNT(T$30:T52))/2)-1))*100) + (100-(BETADIST(AY52,((COUNT(T$30:T52))/2)-1,((COUNT(T$30:T52))/2)-1))*100) - 100) + 55) / 100","v":{"$error":"#VALUE!"}},{"$f":"(0.5 * ((100-(BETADIST(AS52,((COUNT(AA$30:AA52))/2)-1,((COUNT(AA$30:AA52))/2)-1))*100) + (100-(BETADIST(AZ52,((COUNT(AA$30:AA52))/2)-1,((COUNT(AA$30:AA52))/2)-1))*100) - 100) + 55) / 100","v":{"$error":"#DIV/0!"}},{"$f":"(0.5 * ((100-(BETADIST(AT52,((COUNT(AB$30:AB52))/2)-1,((COUNT(AB$30:AB52))/2)-1))*100) + (100-(BETADIST(BA52,((COUNT(AB$30:AB52))/2)-1,((COUNT(AB$30:AB52))/2)-1))*100) - 100) + 55) / 100","v":{"$error":"#DIV/0!"}},{"$error":"#VALUE!"}]
[null,null,null,null,null,null,null,null,null,null,null,null,null,null,null,null,null,null,null,null,null,null,null,null,null,null,"","",null,null,0,0,0,0,0,0,0,{"$f":"IF((MAX(0,(0.5-(($AL$21-AVERAGE($N$30:N53))/(IF(STDEV($N$30:N53)<0.01,0.01,STDEV($N$30:N53)))*SQRT(COUNT($N$30:N53))/(2*(COUNT($N$30:N53)-1))))))>1,1,(MAX(0,(0.5-(($AL$21-AVERAGE($N$30:N53))/(IF(STDEV($N$30:N53)<0.01,0.01,STDEV($N$30:N53)))*SQRT(COUNT($N$30:N53))/(2*(COUNT($N$30:N53)-1)))))))","v":{"$error":"#VALUE!"}},0,0,0,0,{"$f":"IF((MAX(0,(0.5-(($AQ$21-AVERAGE($S$30:S53))/(IF(STDEV($S$30:S53)<0.01,0.01,STDEV($S$30:S53)))*SQRT(COUNT($S$30:S53))/(2*(COUNT($S$30:S53)-1))))))>1,1,(MAX(0,(0.5-(($AQ$21-AVERAGE($S$30:S53))/(IF(STDEV($S$30:S53)<0.01,0.01,STDEV($S$30:S53)))*SQRT(COUNT($S$30:S53))/(2*(COUNT($S$30:S53)-1)))))))","v":{"$error":"#VALUE!"}},{"$f":"IF((MAX(0,(0.5-(($AR$21-AVERAGE($T$30:T53))/(IF(STDEV($T$30:T53)<0.01,0.01,STDEV($T$30:T53)))*SQRT(COUNT($T$30:T53))/(2*(COUNT($T$30:T53)-1))))))>1,1,(MAX(0,(0.5-(($AR$21-AVERAGE($T$30:T53))/(IF(STDEV($T$30:T53)<0.01,0.01,STDEV($T$30:T53)))*SQRT(COUNT($T$30:T53))/(2*(COUNT($T$30:T53)-1)))))))","v":{"$error":"#VALUE!"}},{"$f":"IF((MAX(0,(0.5-(($AS$21-AVERAGE($AA$30:AA53))/(IF(STDEV($AA$30:AA53)<0.01,0.01,STDEV($AA$30:AA53)))*SQRT(COUNT($AA$30:AA53))/(2*(COUNT($AA$30:AA53)-1))))))>1,1,(MAX(0,(0.5-(($AS$21-AVERAGE($AA$30:AA53))/(IF(STDEV($AA$30:AA53)<0.01,0.01,STDEV($AA$30:AA53)))*SQRT(COUNT($AA$30:AA53))/(2*(COUNT($AA$30:AA53)-1)))))))","v":{"$error":"#DIV/0!"}},{"$f":"IF((MAX(0,(0.5-(($AT$21-AVERAGE($AB$30:AB53))/(IF(STDEV($AB$30:AB53)<0.01,0.01,STDEV($AB$30:AB53)))*SQRT(COUNT($AB$30:AB53))/(2*(COUNT($AB$30:AB53)-1))))))>1,1,(MAX(0,(0.5-(($AT$21-AVERAGE($AB$30:AB53))/(IF(STDEV($AB$30:AB53)<0.01,0.01,STDEV($AB$30:AB53)))*SQRT(COUNT($AB$30:AB53))/(2*(COUNT($AB$30:AB53)-1)))))))","v":{"$error":"#DIV/0!"}},null,null,{"$f":"IF((MAX(0,(0.5-((AVERAGE($N$30:N53)-$AW$22)/(IF(STDEV($N$30:N53)<0.01,0.01,STDEV($N$30:N53)))*SQRT(COUNT($N$30:N53))/(2*(COUNT($N$30:N53)-1))))))>1,1,(MAX(0,(0.5-((AVERAGE($N$30:N53)-$AW$22)/(IF(STDEV($N$30:N53)<0.01,0.01,STDEV($N$30:N53)))*SQRT(COUNT($N$30:N53))/(2*(COUNT($N$30:N53)-1)))))))","v":{"$error":"#DIV/0!"}},{"$f":"IF((MAX(0,(0.5-((AVERAGE($S$30:S53)-$AX$22)/(IF(STDEV($S$30:S53)<0.01,0.01,STDEV($S$30:S53)))*SQRT(COUNT($S$30:S53))/(2*(COUNT($S$30:S53)-1))))))>1,1,(MAX(0,(0.5-((AVERAGE($S$30:S53)-$AX$22)/(IF(STDEV($S$30:S53)<0.01,0.01,STDEV($S$30:S53)))*SQRT(COUNT($S$30:S53))/(2*(COUNT($S$30:S53)-1)))))))","v":{"$error":"#DIV/0!"}},{"$f":"IF((MAX(0,(0.5-((AVERAGE($T$30:T53)-$AY$22)/(IF(STDEV($T$30:T53)<0.01,0.01,STDEV($T$30:T53)))*SQRT(COUNT($T$30:T53))/(2*(COUNT($T$30:T53)-1))))))>1,1,(MAX(0,(0.5-((AVERAGE($T$30:T53)-$AY$22)/(IF(STDEV($T$30:T53)<0.01,0.01,STDEV($T$30:T53)))*SQRT(COUNT($T$30:T53))/(2*(COUNT($T$30:T53)-1)))))))","v":{"$error":"#DIV/0!"}},{"$f":"IF((MAX(0,(0.5-((AVERAGE($AA$30:AA53)-$AZ$22)/(IF(STDEV($AA$30:AA53)<0.01,0.01,STDEV($AA$30:AA53)))*SQRT(COUNT($AA$30:AA53))/(2*(COUNT($AA$30:AA53)-1))))))>1,1,(MAX(0,(0.5-((AVERAGE($AA$30:AA53)-$AZ$22)/(IF(STDEV($AA$30:AA53)<0.01,0.01,STDEV($AA$30:AA53)))*SQRT(COUNT($AA$30:AA53))/(2*(COUNT($AA$30:AA53)-1)))))))","v":{"$error":"#DIV/0!"}},{"$f":"IF((MAX(0,(0.5-((AVERAGE($AB$30:AB53)-$BA$22)/(IF(STDEV($AB$30:AB53)<0.01,0.01,STDEV($AB$30:AB53)))*SQRT(COUNT($AB$30:AB53))/(2*(COUNT($AB$30:AB53)-1))))))>1,1,(MAX(0,(0.5-((AVERAGE($AB$30:AB53)-$BA$22)/(IF(STDEV($AB$30:AB53)<0.01,0.01,STDEV($AB$30:AB53)))*SQRT(COUNT($AB$30:AB53))/(2*(COUNT($AB$30:AB53)-1)))))))","v":{"$error":"#DIV/0!"}},null,null,null,{"$f":"(0.5 * ((100-(BETADIST(AL53,((COUNT(N$30:N53))/2)-1,((COUNT(N$30:N53))/2)-1))*100) + (100-(BETADIST(AW53,((COUNT(N$30:N53))/2)-1,((COUNT(N$30:N53))/2)-1))*100) - 100) + 55) / 100","v":{"$error":"#VALUE!"}},{"$f":"(0.5 * ((100-(BETADIST(AQ53,((COUNT(S$30:S53))/2)-1,((COUNT(S$30:S53))/2)-1))*100) + (100-(BETADIST(AX53,((COUNT(S$30:S53))/2)-1,((COUNT(S$30:S53))/2)-1))*100) - 100) + 55) / 100","v":{"$error":"#VALUE!"}},{"$f":"(0.5 * ((100-(BETADIST(AR53,((COUNT(T$30:T53))/2)-1,((COUNT(T$30:T53))/2)-1))*100) + (100-(BETADIST(AY53,((COUNT(T$30:T53))/2)-1,((COUNT(T$30:T53))/2)-1))*100) - 100) + 55) / 100","v":{"$error":"#VALUE!"}},{"$f":"(0.5 * ((100-(BETADIST(AS53,((COUNT(AA$30:AA53))/2)-1,((COUNT(AA$30:AA53))/2)-1))*100) + (100-(BETADIST(AZ53,((COUNT(AA$30:AA53))/2)-1,((COUNT(AA$30:AA53))/2)-1))*100) - 100) + 55) / 100","v":{"$error":"#DIV/0!"}},{"$f":"(0.5 * ((100-(BETADIST(AT53,((COUNT(AB$30:AB53))/2)-1,((COUNT(AB$30:AB53))/2)-1))*100) + (100-(BETADIST(BA53,((COUNT(AB$30:AB53))/2)-1,((COUNT(AB$30:AB53))/2)-1))*100) - 100) + 55) / 100","v":{"$error":"#DIV/0!"}},{"$error":"#VALUE!"}]
[null,null,null,null,null,null,null,null,null,null,null,null,null,null,null,null,null,null,null,null,null,null,null,null,null,null,"","",null,null,0,0,0,0,0,0,0,{"$f":"IF((MAX(0,(0.5-(($AL$21-AVERAGE($N$30:N54))/(IF(STDEV($N$30:N54)<0.01,0.01,STDEV($N$30:N54)))*SQRT(COUNT($N$30:N54))/(2*(COUNT($N$30:N54)-1))))))>1,1,(MAX(0,(0.5-(($AL$21-AVERAGE($N$30:N54))/(IF(STDEV($N$30:N54)<0.01,0.01,STDEV($N$30:N54)))*SQRT(COUNT($N$30:N54))/(2*(COUNT($N$30:N54)-1)))))))","v":{"$error":"#VALUE!"}},0,0,0,0,{"$f":"IF((MAX(0,(0.5-(($AQ$21-AVERAGE($S$30:S54))/(IF(STDEV($S$30:S54)<0.01,0.01,STDEV($S$30:S54)))*SQRT(COUNT($S$30:S54))/(2*(COUNT($S$30:S54)-1))))))>1,1,(MAX(0,(0.5-(($AQ$21-AVERAGE($S$30:S54))/(IF(STDEV($S$30:S54)<0.01,0.01,STDEV($S$30:S54)))*SQRT(COUNT($S$30:S54))/(2*(COUNT($S$30:S54)-1)))))))","v":{"$error":"#VALUE!"}},{"$f":"IF((MAX(0,(0.5-(($AR$21-AVERAGE($T$30:T54))/(IF(STDEV($T$30:T54)<0.01,0.01,STDEV($T$30:T54)))*SQRT(COUNT($T$30:T54))/(2*(COUNT($T$30:T54)-1))))))>1,1,(MAX(0,(0.5-(($AR$21-AVERAGE($T$30:T54))/(IF(STDEV($T$30:T54)<0.01,0.01,STDEV($T$30:T54)))*SQRT(COUNT($T$30:T54))/(2*(COUNT($T$30:T54)-1)))))))","v":{"$error":"#VALUE!"}},{"$f":"IF((MAX(0,(0.5-(($AS$21-AVERAGE($AA$30:AA54))/(IF(STDEV($AA$30:AA54)<0.01,0.01,STDEV($AA$30:AA54)))*SQRT(COUNT($AA$30:AA54))/(2*(COUNT($AA$30:AA54)-1))))))>1,1,(MAX(0,(0.5-(($AS$21-AVERAGE($AA$30:AA54))/(IF(STDEV($AA$30:AA54)<0.01,0.01,STDEV($AA$30:AA54)))*SQRT(COUNT($AA$30:AA54))/(2*(COUNT($AA$30:AA54)-1)))))))","v":{"$error":"#DIV/0!"}},{"$f":"IF((MAX(0,(0.5-(($AT$21-AVERAGE($AB$30:AB54))/(IF(STDEV($AB$30:AB54)<0.01,0.01,STDEV($AB$30:AB54)))*SQRT(COUNT($AB$30:AB54))/(2*(COUNT($AB$30:AB54)-1))))))>1,1,(MAX(0,(0.5-(($AT$21-AVERAGE($AB$30:AB54))/(IF(STDEV($AB$30:AB54)<0.01,0.01,STDEV($AB$30:AB54)))*SQRT(COUNT($AB$30:AB54))/(2*(COUNT($AB$30:AB54)-1)))))))","v":{"$error":"#DIV/0!"}},null,null,{"$f":"IF((MAX(0,(0.5-((AVERAGE($N$30:N54)-$AW$22)/(IF(STDEV($N$30:N54)<0.01,0.01,STDEV($N$30:N54)))*SQRT(COUNT($N$30:N54))/(2*(COUNT($N$30:N54)-1))))))>1,1,(MAX(0,(0.5-((AVERAGE($N$30:N54)-$AW$22)/(IF(STDEV($N$30:N54)<0.01,0.01,STDEV($N$30:N54)))*SQRT(COUNT($N$30:N54))/(2*(COUNT($N$30:N54)-1)))))))","v":{"$error":"#DIV/0!"}},{"$f":"IF((MAX(0,(0.5-((AVERAGE($S$30:S54)-$AX$22)/(IF(STDEV($S$30:S54)<0.01,0.01,STDEV($S$30:S54)))*SQRT(COUNT($S$30:S54))/(2*(COUNT($S$30:S54)-1))))))>1,1,(MAX(0,(0.5-((AVERAGE($S$30:S54)-$AX$22)/(IF(STDEV($S$30:S54)<0.01,0.01,STDEV($S$30:S54)))*SQRT(COUNT($S$30:S54))/(2*(COUNT($S$30:S54)-1)))))))","v":{"$error":"#DIV/0!"}},{"$f":"IF((MAX(0,(0.5-((AVERAGE($T$30:T54)-$AY$22)/(IF(STDEV($T$30:T54)<0.01,0.01,STDEV($T$30:T54)))*SQRT(COUNT($T$30:T54))/(2*(COUNT($T$30:T54)-1))))))>1,1,(MAX(0,(0.5-((AVERAGE($T$30:T54)-$AY$22)/(IF(STDEV($T$30:T54)<0.01,0.01,STDEV($T$30:T54)))*SQRT(COUNT($T$30:T54))/(2*(COUNT($T$30:T54)-1)))))))","v":{"$error":"#DIV/0!"}},{"$f":"IF((MAX(0,(0.5-((AVERAGE($AA$30:AA54)-$AZ$22)/(IF(STDEV($AA$30:AA54)<0.01,0.01,STDEV($AA$30:AA54)))*SQRT(COUNT($AA$30:AA54))/(2*(COUNT($AA$30:AA54)-1))))))>1,1,(MAX(0,(0.5-((AVERAGE($AA$30:AA54)-$AZ$22)/(IF(STDEV($AA$30:AA54)<0.01,0.01,STDEV($AA$30:AA54)))*SQRT(COUNT($AA$30:AA54))/(2*(COUNT($AA$30:AA54)-1)))))))","v":{"$error":"#DIV/0!"}},{"$f":"IF((MAX(0,(0.5-((AVERAGE($AB$30:AB54)-$BA$22)/(IF(STDEV($AB$30:AB54)<0.01,0.01,STDEV($AB$30:AB54)))*SQRT(COUNT($AB$30:AB54))/(2*(COUNT($AB$30:AB54)-1))))))>1,1,(MAX(0,(0.5-((AVERAGE($AB$30:AB54)-$BA$22)/(IF(STDEV($AB$30:AB54)<0.01,0.01,STDEV($AB$30:AB54)))*SQRT(COUNT($AB$30:AB54))/(2*(COUNT($AB$30:AB54)-1)))))))","v":{"$error":"#DIV/0!"}},null,null,null,{"$f":"(0.5 * ((100-(BETADIST(AL54,((COUNT(N$30:N54))/2)-1,((COUNT(N$30:N54))/2)-1))*100) + (100-(BETADIST(AW54,((COUNT(N$30:N54))/2)-1,((COUNT(N$30:N54))/2)-1))*100) - 100) + 55) / 100","v":{"$error":"#VALUE!"}},{"$f":"(0.5 * ((100-(BETADIST(AQ54,((COUNT(S$30:S54))/2)-1,((COUNT(S$30:S54))/2)-1))*100) + (100-(BETADIST(AX54,((COUNT(S$30:S54))/2)-1,((COUNT(S$30:S54))/2)-1))*100) - 100) + 55) / 100","v":{"$error":"#VALUE!"}},{"$f":"(0.5 * ((100-(BETADIST(AR54,((COUNT(T$30:T54))/2)-1,((COUNT(T$30:T54))/2)-1))*100) + (100-(BETADIST(AY54,((COUNT(T$30:T54))/2)-1,((COUNT(T$30:T54))/2)-1))*100) - 100) + 55) / 100","v":{"$error":"#VALUE!"}},{"$f":"(0.5 * ((100-(BETADIST(AS54,((COUNT(AA$30:AA54))/2)-1,((COUNT(AA$30:AA54))/2)-1))*100) + (100-(BETADIST(AZ54,((COUNT(AA$30:AA54))/2)-1,((COUNT(AA$30:AA54))/2)-1))*100) - 100) + 55) / 100","v":{"$error":"#DIV/0!"}},{"$f":"(0.5 * ((100-(BETADIST(AT54,((COUNT(AB$30:AB54))/2)-1,((COUNT(AB$30:AB54))/2)-1))*100) + (100-(BETADIST(BA54,((COUNT(AB$30:AB54))/2)-1,((COUNT(AB$30:AB54))/2)-1))*100) - 100) + 55) / 100","v":{"$error":"#DIV/0!"}},{"$error":"#VALUE!"}]
[null,null,null,null,null,null,null,null,null,null,null,null,null,null,null,null,null,null,null,null,null,null,null,null,null,null,"","",null,null,0,0,0,0,0,0,0,{"$f":"IF((MAX(0,(0.5-(($AL$21-AVERAGE($N$30:N55))/(IF(STDEV($N$30:N55)<0.01,0.01,STDEV($N$30:N55)))*SQRT(COUNT($N$30:N55))/(2*(COUNT($N$30:N55)-1))))))>1,1,(MAX(0,(0.5-(($AL$21-AVERAGE($N$30:N55))/(IF(STDEV($N$30:N55)<0.01,0.01,STDEV($N$30:N55)))*SQRT(COUNT($N$30:N55))/(2*(COUNT($N$30:N55)-1)))))))","v":{"$error":"#VALUE!"}},0,0,0,0,{"$f":"IF((MAX(0,(0.5-(($AQ$21-AVERAGE($S$30:S55))/(IF(STDEV($S$30:S55)<0.01,0.01,STDEV($S$30:S55)))*SQRT(COUNT($S$30:S55))/(2*(COUNT($S$30:S55)-1))))))>1,1,(MAX(0,(0.5-(($AQ$21-AVERAGE($S$30:S55))/(IF(STDEV($S$30:S55)<0.01,0.01,STDEV($S$30:S55)))*SQRT(COUNT($S$30:S55))/(2*(COUNT($S$30:S55)-1)))))))","v":{"$error":"#VALUE!"}},{"$f":"IF((MAX(0,(0.5-(($AR$21-AVERAGE($T$30:T55))/(IF(STDEV($T$30:T55)<0.01,0.01,STDEV($T$30:T55)))*SQRT(COUNT($T$30:T55))/(2*(COUNT($T$30:T55)-1))))))>1,1,(MAX(0,(0.5-(($AR$21-AVERAGE($T$30:T55))/(IF(STDEV($T$30:T55)<0.01,0.01,STDEV($T$30:T55)))*SQRT(COUNT($T$30:T55))/(2*(COUNT($T$30:T55)-1)))))))","v":{"$error":"#VALUE!"}},{"$f":"IF((MAX(0,(0.5-(($AS$21-AVERAGE($AA$30:AA55))/(IF(STDEV($AA$30:AA55)<0.01,0.01,STDEV($AA$30:AA55)))*SQRT(COUNT($AA$30:AA55))/(2*(COUNT($AA$30:AA55)-1))))))>1,1,(MAX(0,(0.5-(($AS$21-AVERAGE($AA$30:AA55))/(IF(STDEV($AA$30:AA55)<0.01,0.01,STDEV($AA$30:AA55)))*SQRT(COUNT($AA$30:AA55))/(2*(COUNT($AA$30:AA55)-1)))))))","v":{"$error":"#DIV/0!"}},{"$f":"IF((MAX(0,(0.5-(($AT$21-AVERAGE($AB$30:AB55))/(IF(STDEV($AB$30:AB55)<0.01,0.01,STDEV($AB$30:AB55)))*SQRT(COUNT($AB$30:AB55))/(2*(COUNT($AB$30:AB55)-1))))))>1,1,(MAX(0,(0.5-(($AT$21-AVERAGE($AB$30:AB55))/(IF(STDEV($AB$30:AB55)<0.01,0.01,STDEV($AB$30:AB55)))*SQRT(COUNT($AB$30:AB55))/(2*(COUNT($AB$30:AB55)-1)))))))","v":{"$error":"#DIV/0!"}},null,null,{"$f":"IF((MAX(0,(0.5-((AVERAGE($N$30:N55)-$AW$22)/(IF(STDEV($N$30:N55)<0.01,0.01,STDEV($N$30:N55)))*SQRT(COUNT($N$30:N55))/(2*(COUNT($N$30:N55)-1))))))>1,1,(MAX(0,(0.5-((AVERAGE($N$30:N55)-$AW$22)/(IF(STDEV($N$30:N55)<0.01,0.01,STDEV($N$30:N55)))*SQRT(COUNT($N$30:N55))/(2*(COUNT($N$30:N55)-1)))))))","v":{"$error":"#DIV/0!"}},{"$f":"IF((MAX(0,(0.5-((AVERAGE($S$30:S55)-$AX$22)/(IF(STDEV($S$30:S55)<0.01,0.01,STDEV($S$30:S55)))*SQRT(COUNT($S$30:S55))/(2*(COUNT($S$30:S55)-1))))))>1,1,(MAX(0,(0.5-((AVERAGE($S$30:S55)-$AX$22)/(IF(STDEV($S$30:S55)<0.01,0.01,STDEV($S$30:S55)))*SQRT(COUNT($S$30:S55))/(2*(COUNT($S$30:S55)-1)))))))","v":{"$error":"#DIV/0!"}},{"$f":"IF((MAX(0,(0.5-((AVERAGE($T$30:T55)-$AY$22)/(IF(STDEV($T$30:T55)<0.01,0.01,STDEV($T$30:T55)))*SQRT(COUNT($T$30:T55))/(2*(COUNT($T$30:T55)-1))))))>1,1,(MAX(0,(0.5-((AVERAGE($T$30:T55)-$AY$22)/(IF(STDEV($T$30:T55)<0.01,0.01,STDEV($T$30:T55)))*SQRT(COUNT($T$30:T55))/(2*(COUNT($T$30:T55)-1)))))))","v":{"$error":"#DIV/0!"}},{"$f":"IF((MAX(0,(0.5-((AVERAGE($AA$30:AA55)-$AZ$22)/(IF(STDEV($AA$30:AA55)<0.01,0.01,STDEV($AA$30:AA55)))*SQRT(COUNT($AA$30:AA55))/(2*(COUNT($AA$30:AA55)-1))))))>1,1,(MAX(0,(0.5-((AVERAGE($AA$30:AA55)-$AZ$22)/(IF(STDEV($AA$30:AA55)<0.01,0.01,STDEV($AA$30:AA55)))*SQRT(COUNT($AA$30:AA55))/(2*(COUNT($AA$30:AA55)-1)))))))","v":{"$error":"#DIV/0!"}},{"$f":"IF((MAX(0,(0.5-((AVERAGE($AB$30:AB55)-$BA$22)/(IF(STDEV($AB$30:AB55)<0.01,0.01,STDEV($AB$30:AB55)))*SQRT(COUNT($AB$30:AB55))/(2*(COUNT($AB$30:AB55)-1))))))>1,1,(MAX(0,(0.5-((AVERAGE($AB$30:AB55)-$BA$22)/(IF(STDEV($AB$30:AB55)<0.01,0.01,STDEV($AB$30:AB55)))*SQRT(COUNT($AB$30:AB55))/(2*(COUNT($AB$30:AB55)-1)))))))","v":{"$error":"#DIV/0!"}},null,null,null,{"$f":"(0.5 * ((100-(BETADIST(AL55,((COUNT(N$30:N55))/2)-1,((COUNT(N$30:N55))/2)-1))*100) + (100-(BETADIST(AW55,((COUNT(N$30:N55))/2)-1,((COUNT(N$30:N55))/2)-1))*100) - 100) + 55) / 100","v":{"$error":"#VALUE!"}},{"$f":"(0.5 * ((100-(BETADIST(AQ55,((COUNT(S$30:S55))/2)-1,((COUNT(S$30:S55))/2)-1))*100) + (100-(BETADIST(AX55,((COUNT(S$30:S55))/2)-1,((COUNT(S$30:S55))/2)-1))*100) - 100) + 55) / 100","v":{"$error":"#VALUE!"}},{"$f":"(0.5 * ((100-(BETADIST(AR55,((COUNT(T$30:T55))/2)-1,((COUNT(T$30:T55))/2)-1))*100) + (100-(BETADIST(AY55,((COUNT(T$30:T55))/2)-1,((COUNT(T$30:T55))/2)-1))*100) - 100) + 55) / 100","v":{"$error":"#VALUE!"}},{"$f":"(0.5 * ((100-(BETADIST(AS55,((COUNT(AA$30:AA55))/2)-1,((COUNT(AA$30:AA55))/2)-1))*100) + (100-(BETADIST(AZ55,((COUNT(AA$30:AA55))/2)-1,((COUNT(AA$30:AA55))/2)-1))*100) - 100) + 55) / 100","v":{"$error":"#DIV/0!"}},{"$f":"(0.5 * ((100-(BETADIST(AT55,((COUNT(AB$30:AB55))/2)-1,((COUNT(AB$30:AB55))/2)-1))*100) + (100-(BETADIST(BA55,((COUNT(AB$30:AB55))/2)-1,((COUNT(AB$30:AB55))/2)-1))*100) - 100) + 55) / 100","v":{"$error":"#DIV/0!"}},{"$error":"#VALUE!"}]
[null,null,null,null,null,null,null,null,null,null,null,null,null,null,null,null,null,null,null,null,null,null,null,null,null,null,"","",null,null,0,0,0,0,0,0,0,{"$f":"IF((MAX(0,(0.5-(($AL$21-AVERAGE($N$30:N56))/(IF(STDEV($N$30:N56)<0.01,0.01,STDEV($N$30:N56)))*SQRT(COUNT($N$30:N56))/(2*(COUNT($N$30:N56)-1))))))>1,1,(MAX(0,(0.5-(($AL$21-AVERAGE($N$30:N56))/(IF(STDEV($N$30:N56)<0.01,0.01,STDEV($N$30:N56)))*SQRT(COUNT($N$30:N56))/(2*(COUNT($N$30:N56)-1)))))))","v":{"$error":"#VALUE!"}},0,0,0,0,{"$f":"IF((MAX(0,(0.5-(($AQ$21-AVERAGE($S$30:S56))/(IF(STDEV($S$30:S56)<0.01,0.01,STDEV($S$30:S56)))*SQRT(COUNT($S$30:S56))/(2*(COUNT($S$30:S56)-1))))))>1,1,(MAX(0,(0.5-(($AQ$21-AVERAGE($S$30:S56))/(IF(STDEV($S$30:S56)<0.01,0.01,STDEV($S$30:S56)))*SQRT(COUNT($S$30:S56))/(2*(COUNT($S$30:S56)-1)))))))","v":{"$error":"#VALUE!"}},{"$f":"IF((MAX(0,(0.5-(($AR$21-AVERAGE($T$30:T56))/(IF(STDEV($T$30:T56)<0.01,0.01,STDEV($T$30:T56)))*SQRT(COUNT($T$30:T56))/(2*(COUNT($T$30:T56)-1))))))>1,1,(MAX(0,(0.5-(($AR$21-AVERAGE($T$30:T56))/(IF(STDEV($T$30:T56)<0.01,0.01,STDEV($T$30:T56)))*SQRT(COUNT($T$30:T56))/(2*(COUNT($T$30:T56)-1)))))))","v":{"$error":"#VALUE!"}},{"$f":"IF((MAX(0,(0.5-(($AS$21-AVERAGE($AA$30:AA56))/(IF(STDEV($AA$30:AA56)<0.01,0.01,STDEV($AA$30:AA56)))*SQRT(COUNT($AA$30:AA56))/(2*(COUNT($AA$30:AA56)-1))))))>1,1,(MAX(0,(0.5-(($AS$21-AVERAGE($AA$30:AA56))/(IF(STDEV($AA$30:AA56)<0.01,0.01,STDEV($AA$30:AA56)))*SQRT(COUNT($AA$30:AA56))/(2*(COUNT($AA$30:AA56)-1)))))))","v":{"$error":"#DIV/0!"}},{"$f":"IF((MAX(0,(0.5-(($AT$21-AVERAGE($AB$30:AB56))/(IF(STDEV($AB$30:AB56)<0.01,0.01,STDEV($AB$30:AB56)))*SQRT(COUNT($AB$30:AB56))/(2*(COUNT($AB$30:AB56)-1))))))>1,1,(MAX(0,(0.5-(($AT$21-AVERAGE($AB$30:AB56))/(IF(STDEV($AB$30:AB56)<0.01,0.01,STDEV($AB$30:AB56)))*SQRT(COUNT($AB$30:AB56))/(2*(COUNT($AB$30:AB56)-1)))))))","v":{"$error":"#DIV/0!"}},null,null,{"$f":"IF((MAX(0,(0.5-((AVERAGE($N$30:N56)-$AW$22)/(IF(STDEV($N$30:N56)<0.01,0.01,STDEV($N$30:N56)))*SQRT(COUNT($N$30:N56))/(2*(COUNT($N$30:N56)-1))))))>1,1,(MAX(0,(0.5-((AVERAGE($N$30:N56)-$AW$22)/(IF(STDEV($N$30:N56)<0.01,0.01,STDEV($N$30:N56)))*SQRT(COUNT($N$30:N56))/(2*(COUNT($N$30:N56)-1)))))))","v":{"$error":"#DIV/0!"}},{"$f":"IF((MAX(0,(0.5-((AVERAGE($S$30:S56)-$AX$22)/(IF(STDEV($S$30:S56)<0.01,0.01,STDEV($S$30:S56)))*SQRT(COUNT($S$30:S56))/(2*(COUNT($S$30:S56)-1))))))>1,1,(MAX(0,(0.5-((AVERAGE($S$30:S56)-$AX$22)/(IF(STDEV($S$30:S56)<0.01,0.01,STDEV($S$30:S56)))*SQRT(COUNT($S$30:S56))/(2*(COUNT($S$30:S56)-1)))))))","v":{"$error":"#DIV/0!"}},{"$f":"IF((MAX(0,(0.5-((AVERAGE($T$30:T56)-$AY$22)/(IF(STDEV($T$30:T56)<0.01,0.01,STDEV($T$30:T56)))*SQRT(COUNT($T$30:T56))/(2*(COUNT($T$30:T56)-1))))))>1,1,(MAX(0,(0.5-((AVERAGE($T$30:T56)-$AY$22)/(IF(STDEV($T$30:T56)<0.01,0.01,STDEV($T$30:T56)))*SQRT(COUNT($T$30:T56))/(2*(COUNT($T$30:T56)-1)))))))","v":{"$error":"#DIV/0!"}},{"$f":"IF((MAX(0,(0.5-((AVERAGE($AA$30:AA56)-$AZ$22)/(IF(STDEV($AA$30:AA56)<0.01,0.01,STDEV($AA$30:AA56)))*SQRT(COUNT($AA$30:AA56))/(2*(COUNT($AA$30:AA56)-1))))))>1,1,(MAX(0,(0.5-((AVERAGE($AA$30:AA56)-$AZ$22)/(IF(STDEV($AA$30:AA56)<0.01,0.01,STDEV($AA$30:AA56)))*SQRT(COUNT($AA$30:AA56))/(2*(COUNT($AA$30:AA56)-1)))))))","v":{"$error":"#DIV/0!"}},{"$f":"IF((MAX(0,(0.5-((AVERAGE($AB$30:AB56)-$BA$22)/(IF(STDEV($AB$30:AB56)<0.01,0.01,STDEV($AB$30:AB56)))*SQRT(COUNT($AB$30:AB56))/(2*(COUNT($AB$30:AB56)-1))))))>1,1,(MAX(0,(0.5-((AVERAGE($AB$30:AB56)-$BA$22)/(IF(STDEV($AB$30:AB56)<0.01,0.01,STDEV($AB$30:AB56)))*SQRT(COUNT($AB$30:AB56))/(2*(COUNT($AB$30:AB56)-1)))))))","v":{"$error":"#DIV/0!"}},null,null,null,{"$f":"(0.5 * ((100-(BETADIST(AL56,((COUNT(N$30:N56))/2)-1,((COUNT(N$30:N56))/2)-1))*100) + (100-(BETADIST(AW56,((COUNT(N$30:N56))/2)-1,((COUNT(N$30:N56))/2)-1))*100) - 100) + 55) / 100","v":{"$error":"#VALUE!"}},{"$f":"(0.5 * ((100-(BETADIST(AQ56,((COUNT(S$30:S56))/2)-1,((COUNT(S$30:S56))/2)-1))*100) + (100-(BETADIST(AX56,((COUNT(S$30:S56))/2)-1,((COUNT(S$30:S56))/2)-1))*100) - 100) + 55) / 100","v":{"$error":"#VALUE!"}},{"$f":"(0.5 * ((100-(BETADIST(AR56,((COUNT(T$30:T56))/2)-1,((COUNT(T$30:T56))/2)-1))*100) + (100-(BETADIST(AY56,((COUNT(T$30:T56))/2)-1,((COUNT(T$30:T56))/2)-1))*100) - 100) + 55) / 100","v":{"$error":"#VALUE!"}},{"$f":"(0.5 * ((100-(BETADIST(AS56,((COUNT(AA$30:AA56))/2)-1,((COUNT(AA$30:AA56))/2)-1))*100) + (100-(BETADIST(AZ56,((COUNT(AA$30:AA56))/2)-1,((COUNT(AA$30:AA56))/2)-1))*100) - 100) + 55) / 100","v":{"$error":"#DIV/0!"}},{"$f":"(0.5 * ((100-(BETADIST(AT56,((COUNT(AB$30:AB56))/2)-1,((COUNT(AB$30:AB56))/2)-1))*100) + (100-(BETADIST(BA56,((COUNT(AB$30:AB56))/2)-1,((COUNT(AB$30:AB56))/2)-1))*100) - 100) + 55) / 100","v":{"$error":"#DIV/0!"}},{"$error":"#VALUE!"}]
[]
[]
[]
[]
[]
[]
[]
[]
[]
[]
[]
[]
[]
[]
[]
[]
[]
[]
[null,null,null,null,null,null,null,"Note: PWL values calculated per the SPF specifications are based on FHWA provided formulas using a Beta Distribution.  The normal distribution curves above are provided for information only."]
[null,null,null,null,null,null,null,null,"Note a Beta Distribution Curve can indicate 100 percent within limit (PWL) where the Normal Distribution Curve(s) plotted above can indicate less than 100 PWL."]
[null,null,null,null,null,null,null,null,null,null,null,null,null,null,null,null,null,null,null,null,null,null,null,null,null,null,null,null,null,null,null,null,null,null,null,null,null,null,null,null,null,null,null,null,null,null,null,null,null,null,null,null,null,null,null,null,null,null,null,null,null,null,null,null,null,null,null,null,null,null,null,null,null,null,null,null,null,"DATA BELOW IS FOR PLOTTING NORMAL DISTRIBUTION CURVES"]
[]
[]
[]
[null,null,null,null,null,null,null,null,null,null,null,null,null,null,null,null,null,null,null,null,null,null,null,null,null,null,null,null,null,null,null,null,null,null,null,null,null,null,null,null,null,null,null,null,null,null,null,null,null,null,null,null,null,null,null,null,null,null,null,null,null,null,null,null,null,null,null,null,null,null,null,null,null,null,null,null,null,"Chart Title",{"$f":"IF(_n8<3,\"No 8 Sieve\",\"No 8 Sieve                          \"&ROUND(100*CA85,2)&\" PWL\")","v":"No 8 Sieve"},null,null,null,{"$f":"\"No 200 Sieve                          \"&ROUND(100*CE85,2)&\" PWL\"","v":{"$error":"#VALUE!"}},null,null,null,{"$f":"\"Binder Content                   \"&ROUND(100*CI85,2)&\" PWL\"","v":{"$error":"#VALUE!"}},null,null,null,{"$f":"\"% MTD                      \"&ROUND(100*CM85,2)&\" PWL\"","v":{"$error":"#DIV/0!"}},null,null,null,{"$f":"\"% Air Voids               \"&ROUND(100*CQ85,2)&\" PWL\"","v":{"$error":"#DIV/0!"}}]
[]
[null,null,null,null,null,null,null,null,null,null,null,null,null,null,null,null,null,null,null,null,null,null,null,null,null,null,null,null,null,null,null,null,null,null,null,null,null,null,null,null,null,null,null,null,null,null,null,null,null,null,null,null,null,null,null,null,null,null,null,null,null,null,null,null,null,null,null,null,null,null,null,null,null,null,null,null,null,null,"No 8Sieve",null,null,null,"No 200 Sieve",null,null,null,"Binder Content",null,null,null,"%MTD",null,null,null,"%AirVoids"]
[]
[null,null,null,null,null,null,null,null,null,null,null,null,null,null,null,null,null,null,null,null,null,null,null,null,null,null,null,null,null,null,null,null,null,null,null,null,null,null,null,null,null,null,null,null,null,null,null,null,null,null,null,null,null,null,null,null,null,null,null,null,null,null,null,null,null,null,null,null,null,null,null,null,null,null,null,null,null,"PWL",{"$f":"(CA86-0.55)*2","v":{"$error":"#VALUE!"}},null,null,null,{"$f":"(CE86-0.55)*2","v":{"$error":"#VALUE!"}},null,null,null,{"$f":"(CI86-0.55)*2","v":{"$error":"#VALUE!"}},null,null,null,{"$f":"(CM86-0.55)*2","v":{"$error":"#DIV/0!"}},null,null,null,{"$f":"(CQ86-0.55)*2","v":{"$error":"#DIV/0!"}}]
[null,null,null,null,null,null,null,null,null,null,null,null,null,null,null,null,null,null,null,null,null,null,null,null,null,null,null,null,null,null,null,null,null,null,null,null,null,null,null,null,null,null,null,null,null,null,null,null,null,null,null,null,null,null,null,null,null,null,null,null,null,null,null,null,null,null,null,null,null,null,null,null,null,null,null,null,null,"QFqc",{"$f":"BE56","v":{"$error":"#VALUE!"}},null,null,null,{"$f":"BF56","v":{"$error":"#VALUE!"}},null,null,null,{"$f":"BG56","v":{"$error":"#VALUE!"}},null,null,null,{"$f":"BH56","v":{"$error":"#DIV/0!"}},null,null,null,{"$f":"BI56","v":{"$error":"#DIV/0!"}}]
[]
[null,null,null,null,null,null,null,null,null,null,null,null,null,null,null,null,null,null,null,null,null,null,null,null,null,null,null,null,null,null,null,null,null,null,null,null,null,null,null,null,null,null,null,null,null,null,null,null,null,null,null,null,null,null,null,null,null,null,null,null,null,null,null,null,null,null,null,null,null,null,null,null,null,null,null,null,null,"sd",{"$f":"_sd8","v":""},null,null,null,{"$f":"_sd200","v":""},null,null,null,{"$f":"_sdBC","v":""},null,null,null,{"$f":"_sdMTD","v":""},null,null,null,{"$f":"_sdAV","v":""}]
[null,null,null,null,null,null,null,null,null,null,null,null,null,null,null,null,null,null,null,null,null,null,null,null,null,null,null,null,null,null,null,null,null,null,null,null,null,null,null,null,null,null,null,null,null,null,null,null,null,null,null,null,null,null,null,null,null,null,null,null,null,null,null,null,null,null,null,null,null,null,null,null,null,null,null,null,null,"mean",{"$f":"_mn8","v":{"$error":"#DIV/0!"}},null,null,null,{"$f":"_mn200","v":{"$error":"#DIV/0!"}},null,null,null,{"$f":"_mnBC","v":{"$error":"#DIV/0!"}},null,null,null,{"$f":"_mnMTD","v":{"$error":"#DIV/0!"}},null,null,null,{"$f":"_mnAV","v":{"$error":"#DIV/0!"}}]
[]
[null,null,null,null,null,null,null,null,null,null,null,null,null,null,null,null,null,null,null,null,null,null,null,null,null,null,null,null,null,null,null,null,null,null,null,null,null,null,null,null,null,null,null,null,null,null,null,null,null,null,null,null,null,null,null,null,null,null,null,null,null,null,null,null,null,null,null,null,null,null,null,null,null,null,null,null,null,"USL",{"$f":"LotInfo!J30","v":""},"Position>",{"$f":"IF(ISNA(MATCH(CA91,CA101:CA300)),0,MATCH(CA91,CA101:CA300))","v":200},null,{"$f":"LotInfo!O30","v":""},"Position>",{"$f":"IF(ISNA(MATCH(CE91,CE101:CE300)),0,MATCH(CE91,CE101:CE300))","v":200},null,{"$f":"LotInfo!P30","v":""},"Position>",{"$f":"IF(ISNA(MATCH(CI91,CI101:CI300)),0,MATCH(CI91,CI101:CI300))","v":200},null,{"$f":"LotInfo!Q30","v":96},"Position>",{"$f":"IF(ISNA(MATCH(CM91,CM101:CM300)),0,MATCH(CM91,CM101:CM300))","v":0},null,{"$f":"LotInfo!R30","v":5.5},"Position>",{"$f":"IF(ISNA(MATCH(CQ91,CQ101:CQ300)),0,MATCH(CQ91,CQ101:CQ300))","v":0}]
[null,null,null,null,null,null,null,null,null,null,null,null,null,null,null,null,null,null,null,null,null,null,null,null,null,null,null,null,null,null,null,null,null,null,null,null,null,null,null,null,null,null,null,null,null,null,null,null,null,null,null,null,null,null,null,null,null,null,null,null,null,null,null,null,null,null,null,null,null,null,null,null,null,null,null,null,null,"LSL",{"$f":"LotInfo!J31","v":""},"Position>",{"$f":"IF(ISNA(MATCH(CA92,CA101:CA300)),0,MATCH(CA92,CA101:CA300))","v":200},null,{"$f":"LotInfo!O31","v":""},"Position>",{"$f":"IF(ISNA(MATCH(CE92,CE101:CE300)),0,MATCH(CE92,CE101:CE300))","v":200},null,{"$f":"LotInfo!P31","v":""},"Position>",{"$f":"IF(ISNA(MATCH(CI92,CI101:CI300)),0,MATCH(CI92,CI101:CI300))","v":200},null,{"$f":"LotInfo!Q31","v":92},"Position>",{"$f":"IF(ISNA(MATCH(CM92,CM101:CM300)),0,MATCH(CM92,CM101:CM300))","v":0},null,{"$f":"LotInfo!R31","v":2.5},"Position>",{"$f":"IF(ISNA(MATCH(CQ92,CQ101:CQ300)),0,MATCH(CQ92,CQ101:CQ300))","v":0}]
[null,null,null,null,null,null,null,null,null,null,null,null,null,null,null,null,null,null,null,null,null,null,null,null,null,null,null,null,null,null,null,null,null,null,null,null,null,null,null,null,null,null,null,null,null,null,null,null,null,null,null,null,null,null,null,null,null,null,null,null,null,null,null,null,null,null,null,null,null,null,null,null,null,null,null,null,null,"highest pt",null,"max ht",{"$f":"MAX(CB101:CB300)","v":{"$error":"#VALUE!"}},null,null,"max ht",{"$f":"MAX(CF101:CF300)","v":{"$error":"#VALUE!"}},null,null,"max ht",{"$f":"MAX(CJ101:CJ300)","v":{"$error":"#VALUE!"}},null,null,"max ht",{"$f":"MAX(CN101:CN300)","v":{"$error":"#VALUE!"}},null,null,"max ht",{"$f":"MAX(CR101:CR300)","v":{"$error":"#VALUE!"}}]
[]
[null,null,null,null,null,null,null,null,null,null,null,null,null,null,null,null,null,null,null,null,null,null,null,null,null,null,null,null,null,null,null,null,null,null,null,null,null,null,null,null,null,null,null,null,null,null,null,null,null,null,null,null,null,null,null,null,null,null,null,null,null,null,null,null,null,null,null,null,null,null,null,null,null,null,null,null,null,"-5 SDs",{"$f":"MIN(_mn8-(5*_sd8),CA92)","v":{"$error":"#DIV/0!"}},null,null,null,{"$f":"MIN(_mn200-(5*_sd200),CE92-0.5)","v":{"$error":"#DIV/0!"}},null,null,null,{"$f":"MIN(_mnBC-(5*_sdBC),CI92-0.2)","v":{"$error":"#DIV/0!"}},null,null,null,{"$f":"MIN(_mnMTD-(5*_sdMTD),CM92)","v":{"$error":"#DIV/0!"}},null,null,null,{"$f":"MIN(_mnAV-(3*_sdAV),CQ92-0.25)","v":{"$error":"#DIV/0!"}}]
[null,null,null,null,null,null,null,null,null,null,null,null,null,null,null,null,null,null,null,null,null,null,null,null,null,null,null,null,null,null,null,null,null,null,null,null,null,null,null,null,null,null,null,null,null,null,null,null,null,null,null,null,null,null,null,null,null,null,null,null,null,null,null,null,null,null,null,null,null,null,null,null,null,null,null,null,null,"diff/200",{"$f":"(CA97-CA95)/200","v":{"$error":"#DIV/0!"}},null,null,null,{"$f":"(CE97-CE95)/200","v":{"$error":"#DIV/0!"}},null,null,null,{"$f":"(CI97-CI95)/200","v":{"$error":"#DIV/0!"}},null,null,null,{"$f":"(CM97-CM95)/200","v":{"$error":"#DIV/0!"}},null,null,null,{"$f":"(CQ97-CQ95)/200","v":{"$error":"#DIV/0!"}}]
[null,null,null,null,null,null,null,null,null,null,null,null,null,null,null,null,null,null,null,null,null,null,null,null,null,null,null,null,null,null,null,null,null,null,null,null,null,null,null,null,null,null,null,null,null,null,null,null,null,null,null,null,null,null,null,null,null,null,null,null,null,null,null,null,null,null,null,null,null,null,null,null,null,null,null,null,null,"+5 SD's",{"$f":"MAX(_mn8+(5*_sd8),CA91+1)","v":{"$error":"#DIV/0!"}},null,null,null,{"$f":"MAX(_mn200+(5*_sd200),CE91+0.5)","v":{"$error":"#DIV/0!"}},null,null,null,{"$f":"MAX(_mnBC+(5*_sdBC),CI91+0.2)","v":{"$error":"#DIV/0!"}},null,null,null,{"$f":"MAX(_mnMTD+(5*_sdMTD),CM91)","v":{"$error":"#DIV/0!"}},null,null,null,{"$f":"MAX(_mnAV+(3*_sdAV),CQ91+0.25)","v":{"$error":"#DIV/0!"}}]
[]
[null,null,null,null,null,null,null,null,null,null,null,null,null,null,null,null,null,null,null,null,null,null,null,null,null,null,null,null,null,null,null,null,null,null,null,null,null,null,null,null,null,null,null,null,null,null,null,null,null,null,null,null,null,null,null,null,null,null,null,null,null,null,null,null,null,null,null,null,null,null,null,null,null,null,null,null,null,null,null,"QC's",null,null,null,"QC's",null,null,null,"QC's",null,null,null,"QC's",null,null,null,"QC's"]
[null,null,null,null,null,null,null,null,null,null,null,null,null,null,null,null,null,null,null,null,null,null,null,null,null,null,null,null,null,null,null,null,null,null,null,null,null,null,null,null,null,null,null,null,null,null,null,null,null,null,null,null,null,null,null,null,null,null,null,null,null,null,null,null,null,null,null,null,null,null,null,null,null,null,null,null,null,null,"x-axis","norm-dist","spec",null,"x-axis","norm-dist","spec",null,"x-axis","norm-dist","spec",null,"x-axis","norm-dist","spec",null,"x-axis","norm-dist","spec"]
[null,null,null,null,null,null,null,null,null,null,null,null,null,null,null,null,null,null,null,null,null,null,null,null,null,null,null,null,null,null,null,null,null,null,null,null,null,null,null,null,null,null,null,null,null,null,null,null,null,null,null,null,null,null,null,null,null,null,null,null,null,null,null,null,null,null,null,null,null,null,null,null,null,null,null,null,null,1,{"$f":"IF(ISNUMBER(CA$95),CA$95+($BZ101*CA$96),\"\")","v":""},{"$f":"NORMDIST(CA101,_mn8,_sd8,0)","v":{"$error":"#VALUE!"}},{"$f":"IF(OR($BZ101=CC$91,$BZ101=CC$92),CC$93,0)","v":0},null,{"$f":"IF(ISNUMBER(CE$95),CE$95+(BZ101*CE$96),\"\")","v":""},{"$f":"NORMDIST(CE101,_mn200,_sd200,0)","v":{"$error":"#VALUE!"}},{"$f":"IF(OR($BZ101=CG$91,$BZ101=CG$92),CG$93,0)","v":0},null,{"$f":"IF(ISNUMBER(CI$95),CI$95+($BZ101*CI$96),\"\")","v":""},{"$f":"NORMDIST(CI101,_mnBC,_sdBC,0)","v":{"$error":"#VALUE!"}},{"$f":"IF(OR($BZ101=CK$91,$BZ101=CK$92),CK$93,0)","v":0},null,{"$f":"IF(ISNUMBER(CM$95),CM$95+($BZ101*CM$96),\"\")","v":""},{"$f":"NORMDIST(CM101,_mnMTD,_sdMTD,0)","v":{"$error":"#VALUE!"}},{"$f":"IF(OR($BZ101=CO$91,$BZ101=CO$92),CO$93,0)","v":0},null,{"$f":"IF(ISNUMBER(CQ$95),CQ$95+($BZ101*CQ$96),\"\")","v":""},{"$f":"NORMDIST(CQ101,_mnAV,_sdAV,0)","v":{"$error":"#VALUE!"}},{"$f":"IF(OR($BZ101=CS$91,$BZ101=CS$92),CS$93,0)","v":0}]
[null,null,null,null,null,null,null,null,null,null,null,null,null,null,null,null,null,null,null,null,null,null,null,null,null,null,null,null,null,null,null,null,null,null,null,null,null,null,null,null,null,null,null,null,null,null,null,null,null,null,null,null,null,null,null,null,null,null,null,null,null,null,null,null,null,null,null,null,null,null,null,null,null,null,null,null,null,2,{"$f":"IF(ISNUMBER(CA$95),CA$95+(BZ102*CA$96),\"\")","v":""},{"$error":"#VALUE!"},{"$f":"IF(OR($BZ102=CC$91,$BZ102=CC$92),CC$93,0)","v":0},null,{"$f":"IF(ISNUMBER(CE$95),CE$95+(BZ102*CE$96),\"\")","v":""},{"$error":"#VALUE!"},{"$f":"IF(OR($BZ102=CG$91,$BZ102=CG$92),CG$93,0)","v":0},null,{"$f":"IF(ISNUMBER(CI$95),CI$95+($BZ102*CI$96),\"\")","v":""},{"$error":"#VALUE!"},{"$f":"IF(OR($BZ102=CK$91,$BZ102=CK$92),CK$93,0)","v":0},null,{"$f":"IF(ISNUMBER(CM$95),CM$95+($BZ102*CM$96),\"\")","v":""},{"$error":"#VALUE!"},{"$f":"IF(OR($BZ102=CO$91,$BZ102=CO$92),CO$93,0)","v":0},null,{"$f":"IF(ISNUMBER(CQ$95),CQ$95+($BZ102*CQ$96),\"\")","v":""},{"$error":"#VALUE!"},{"$f":"IF(OR($BZ102=CS$91,$BZ102=CS$92),CS$93,0)","v":0}]
[null,null,null,null,null,null,null,null,null,null,null,null,null,null,null,null,null,null,null,null,null,null,null,null,null,null,null,null,null,null,null,null,null,null,null,null,null,null,null,null,null,null,null,null,null,null,null,null,null,null,null,null,null,null,null,null,null,null,null,null,null,null,null,null,null,null,null,null,null,null,null,null,null,null,null,null,null,3,"",{"$error":"#VALUE!"},0,null,"",{"$error":"#VALUE!"},0,null,"",{"$error":"#VALUE!"},0,null,"",{"$error":"#VALUE!"},0,null,"",{"$error":"#VALUE!"},0]
[null,null,null,null,null,null,null,null,null,null,null,null,null,null,null,null,null,null,null,null,null,null,null,null,null,null,null,null,null,null,null,null,null,null,null,null,null,null,null,null,null,null,null,null,null,null,null,null,null,null,null,null,null,null,null,null,null,null,null,null,null,null,null,null,null,null,null,null,null,null,null,null,null,null,null,null,null,4,"",{"$error":"#VALUE!"},0,null,"",{"$error":"#VALUE!"},0,null,"",{"$error":"#VALUE!"},0,null,"",{"$error":"#VALUE!"},0,null,"",{"$error":"#VALUE!"},0]
[null,null,null,null,null,null,null,null,null,null,null,null,null,null,null,null,null,null,null,null,null,null,null,null,null,null,null,null,null,null,null,null,null,null,null,null,null,null,null,null,null,null,null,null,null,null,null,null,null,null,null,null,null,null,null,null,null,null,null,null,null,null,null,null,null,null,null,null,null,null,null,null,null,null,null,null,null,5,"",{"$error":"#VALUE!"},0,null,"",{"$error":"#VALUE!"},0,null,"",{"$error":"#VALUE!"},0,null,"",{"$error":"#VALUE!"},0,null,"",{"$error":"#VALUE!"},0]
[null,null,null,null,null,null,null,null,null,null,null,null,null,null,null,null,null,null,null,null,null,null,null,null,null,null,null,null,null,null,null,null,null,null,null,null,null,null,null,null,null,null,null,null,null,null,null,null,null,null,null,null,null,null,null,null,null,null,null,null,null,null,null,null,null,null,null,null,null,null,null,null,null,null,null,null,null,6,"",{"$error":"#VALUE!"},0,null,"",{"$error":"#VALUE!"},0,null,"",{"$error":"#VALUE!"},0,null,"",{"$error":"#VALUE!"},0,null,"",{"$error":"#VALUE!"},0]
[null,null,null,null,null,null,null,null,null,null,null,null,null,null,null,null,null,null,null,null,null,null,null,null,null,null,null,null,null,null,null,null,null,null,null,null,null,null,null,null,null,null,null,null,null,null,null,null,null,null,null,null,null,null,null,null,null,null,null,null,null,null,null,null,null,null,null,null,null,null,null,null,null,null,null,null,null,7,"",{"$error":"#VALUE!"},0,null,"",{"$error":"#VALUE!"},0,null,"",{"$error":"#VALUE!"},0,null,"",{"$error":"#VALUE!"},0,null,"",{"$error":"#VALUE!"},0]
[null,null,null,null,null,null,null,null,null,null,null,null,null,null,null,null,null,null,null,null,null,null,null,null,null,null,null,null,null,null,null,null,null,null,null,null,null,null,null,null,null,null,null,null,null,null,null,null,null,null,null,null,null,null,null,null,null,null,null,null,null,null,null,null,null,null,null,null,null,null,null,null,null,null,null,null,null,8,"",{"$error":"#VALUE!"},0,null,"",{"$error":"#VALUE!"},0,null,"",{"$error":"#VALUE!"},0,null,"",{"$error":"#VALUE!"},0,null,"",{"$error":"#VALUE!"},{"$f":"IF(OR($BZ108=CS$91,$BZ108=CS$92),CS$93,0)","v":0}]
[null,null,null,null,null,null,null,null,null,null,null,null,null,null,null,null,null,null,null,null,null,null,null,null,null,null,null,null,null,null,null,null,null,null,null,null,null,null,null,null,null,null,null,null,null,null,null,null,null,null,null,null,null,null,null,null,null,null,null,null,null,null,null,null,null,null,null,null,null,null,null,null,null,null,null,null,null,9,"",{"$error":"#VALUE!"},0,null,"",{"$error":"#VALUE!"},0,null,"",{"$error":"#VALUE!"},0,null,"",{"$error":"#VALUE!"},0,null,"",{"$error":"#VALUE!"},0]
[null,null,null,null,null,null,null,null,null,null,null,null,null,null,null,null,null,null,null,null,null,null,null,null,null,null,null,null,null,null,null,null,null,null,null,null,null,null,null,null,null,null,null,null,null,null,null,null,null,null,null,null,null,null,null,null,null,null,null,null,null,null,null,null,null,null,null,null,null,null,null,null,null,null,null,null,null,10,"",{"$error":"#VALUE!"},0,null,"",{"$error":"#VALUE!"},0,null,"",{"$error":"#VALUE!"},0,null,"",{"$error":"#VALUE!"},0,null,"",{"$error":"#VALUE!"},0]
[null,null,null,null,null,null,null,null,null,null,null,null,null,null,null,null,null,null,null,null,null,null,null,null,null,null,null,null,null,null,null,null,null,null,null,null,null,null,null,null,null,null,null,null,null,null,null,null,null,null,null,null,null,null,null,null,null,null,null,null,null,null,null,null,null,null,null,null,null,null,null,null,null,null,null,null,null,11,"",{"$error":"#VALUE!"},0,null,"",{"$error":"#VALUE!"},0,null,"",{"$error":"#VALUE!"},0,null,"",{"$error":"#VALUE!"},0,null,"",{"$error":"#VALUE!"},0]
[null,null,null,null,null,null,null,null,null,null,null,null,null,null,null,null,null,null,null,null,null,null,null,null,null,null,null,null,null,null,null,null,null,null,null,null,null,null,null,null,null,null,null,null,null,null,null,null,null,null,null,null,null,null,null,null,null,null,null,null,null,null,null,null,null,null,null,null,null,null,null,null,null,null,null,null,null,12,"",{"$error":"#VALUE!"},0,null,"",{"$error":"#VALUE!"},0,null,"",{"$error":"#VALUE!"},0,null,"",{"$error":"#VALUE!"},0,null,"",{"$error":"#VALUE!"},0]
[null,null,null,null,null,null,null,null,null,null,null,null,null,null,null,null,null,null,null,null,null,null,null,null,null,null,null,null,null,null,null,null,null,null,null,null,null,null,null,null,null,null,null,null,null,null,null,null,null,null,null,null,null,null,null,null,null,null,null,null,null,null,null,null,null,null,null,null,null,null,null,null,null,null,null,null,null,13,"",{"$error":"#VALUE!"},0,null,"",{"$error":"#VALUE!"},0,null,"",{"$error":"#VALUE!"},0,null,"",{"$error":"#VALUE!"},0,null,"",{"$error":"#VALUE!"},0]
[null,null,null,null,null,null,null,null,null,null,null,null,null,null,null,null,null,null,null,null,null,null,null,null,null,null,null,null,null,null,null,null,null,null,null,null,null,null,null,null,null,null,null,null,null,null,null,null,null,null,null,null,null,null,null,null,null,null,null,null,null,null,null,null,null,null,null,null,null,null,null,null,null,null,null,null,null,14,"",{"$error":"#VALUE!"},0,null,"",{"$error":"#VALUE!"},0,null,"",{"$error":"#VALUE!"},0,null,"",{"$error":"#VALUE!"},0,null,"",{"$error":"#VALUE!"},0]
[null,null,null,null,null,null,null,null,null,null,null,null,null,null,null,null,null,null,null,null,null,null,null,null,null,null,null,null,null,null,null,null,null,null,null,null,null,null,null,null,null,null,null,null,null,null,null,null,null,null,null,null,null,null,null,null,null,null,null,null,null,null,null,null,null,null,null,null,null,null,null,null,null,null,null,null,null,15,"",{"$error":"#VALUE!"},0,null,"",{"$error":"#VALUE!"},0,null,"",{"$error":"#VALUE!"},0,null,"",{"$error":"#VALUE!"},0,null,"",{"$error":"#VALUE!"},0]
[null,null,null,null,null,null,null,null,null,null,null,null,null,null,null,null,null,null,null,null,null,null,null,null,null,null,null,null,null,null,null,null,null,null,null,null,null,null,null,null,null,null,null,null,null,null,null,null,null,null,null,null,null,null,null,null,null,null,null,null,null,null,null,null,null,null,null,null,null,null,null,null,null,null,null,null,null,16,"",{"$error":"#VALUE!"},0,null,"",{"$error":"#VALUE!"},0,null,"",{"$error":"#VALUE!"},0,null,"",{"$error":"#VALUE!"},0,null,"",{"$error":"#VALUE!"},0]
[null,null,null,null,null,null,null,null,null,null,null,null,null,null,null,null,null,null,null,null,null,null,null,null,null,null,null,null,null,null,null,null,null,null,null,null,null,null,null,null,null,null,null,null,null,null,null,null,null,null,null,null,null,null,null,null,null,null,null,null,null,null,null,null,null,null,null,null,null,null,null,null,null,null,null,null,null,17,"",{"$error":"#VALUE!"},0,null,"",{"$error":"#VALUE!"},0,null,"",{"$error":"#VALUE!"},0,null,"",{"$error":"#VALUE!"},0,null,"",{"$error":"#VALUE!"},0]
[null,null,null,null,null,null,null,null,null,null,null,null,null,null,null,null,null,null,null,null,null,null,null,null,null,null,null,null,null,null,null,null,null,null,null,null,null,null,null,null,null,null,null,null,null,null,null,null,null,null,null,null,null,null,null,null,null,null,null,null,null,null,null,null,null,null,null,null,null,null,null,null,null,null,null,null,null,18,"",{"$error":"#VALUE!"},0,null,"",{"$error":"#VALUE!"},0,null,"",{"$error":"#VALUE!"},0,null,"",{"$error":"#VALUE!"},0,null,"",{"$error":"#VALUE!"},0]
[null,null,null,null,null,null,null,null,null,null,null,null,null,null,null,null,null,null,null,null,null,null,null,null,null,null,null,null,null,null,null,null,null,null,null,null,null,null,null,null,null,null,null,null,null,null,null,null,null,null,null,null,null,null,null,null,null,null,null,null,null,null,null,null,null,null,null,null,null,null,null,null,null,null,null,null,null,19,"",{"$error":"#VALUE!"},0,null,"",{"$error":"#VALUE!"},0,null,"",{"$error":"#VALUE!"},0,null,"",{"$error":"#VALUE!"},0,null,"",{"$error":"#VALUE!"},0]
[null,null,null,null,null,null,null,null,null,null,null,null,null,null,null,null,null,null,null,null,null,null,null,null,null,null,null,null,null,null,null,null,null,null,null,null,null,null,null,null,null,null,null,null,null,null,null,null,null,null,null,null,null,null,null,null,null,null,null,null,null,null,null,null,null,null,null,null,null,null,null,null,null,null,null,null,null,20,"",{"$error":"#VALUE!"},0,null,"",{"$error":"#VALUE!"},0,null,"",{"$error":"#VALUE!"},0,null,"",{"$error":"#VALUE!"},0,null,"",{"$error":"#VALUE!"},0]
[null,null,null,null,null,null,null,null,null,null,null,null,null,null,null,null,null,null,null,null,null,null,null,null,null,null,null,null,null,null,null,null,null,null,null,null,null,null,null,null,null,null,null,null,null,null,null,null,null,null,null,null,null,null,null,null,null,null,null,null,null,null,null,null,null,null,null,null,null,null,null,null,null,null,null,null,null,21,"",{"$error":"#VALUE!"},0,null,"",{"$error":"#VALUE!"},0,null,"",{"$error":"#VALUE!"},0,null,"",{"$error":"#VALUE!"},0,null,"",{"$error":"#VALUE!"},0]
[null,null,null,null,null,null,null,null,null,null,null,null,null,null,null,null,null,null,null,null,null,null,null,null,null,null,null,null,null,null,null,null,null,null,null,null,null,null,null,null,null,null,null,null,null,null,null,null,null,null,null,null,null,null,null,null,null,null,null,null,null,null,null,null,null,null,null,null,null,null,null,null,null,null,null,null,null,22,"",{"$error":"#VALUE!"},0,null,"",{"$error":"#VALUE!"},0,null,"",{"$error":"#VALUE!"},0,null,"",{"$error":"#VALUE!"},0,null,"",{"$error":"#VALUE!"},0]
[null,null,null,null,null,null,null,null,null,null,null,null,null,null,null,null,null,null,null,null,null,null,null,null,null,null,null,null,null,null,null,null,null,null,null,null,null,null,null,null,null,null,null,null,null,null,null,null,null,null,null,null,null,null,null,null,null,null,null,null,null,null,null,null,null,null,null,null,null,null,null,null,null,null,null,null,null,23,"",{"$error":"#VALUE!"},0,null,"",{"$error":"#VALUE!"},0,null,"",{"$error":"#VALUE!"},0,null,"",{"$error":"#VALUE!"},0,null,"",{"$error":"#VALUE!"},0]
[null,null,null,null,null,null,null,null,null,null,null,null,null,null,null,null,null,null,null,null,null,null,null,null,null,null,null,null,null,null,null,null,null,null,null,null,null,null,null,null,null,null,null,null,null,null,null,null,null,null,null,null,null,null,null,null,null,null,null,null,null,null,null,null,null,null,null,null,null,null,null,null,null,null,null,null,null,24,"",{"$error":"#VALUE!"},0,null,"",{"$error":"#VALUE!"},0,null,"",{"$error":"#VALUE!"},0,null,"",{"$error":"#VALUE!"},0,null,"",{"$error":"#VALUE!"},0]
[null,null,null,null,null,null,null,null,null,null,null,null,null,null,null,null,null,null,null,null,null,null,null,null,null,null,null,null,null,null,null,null,null,null,null,null,null,null,null,null,null,null,null,null,null,null,null,null,null,null,null,null,null,null,null,null,null,null,null,null,null,null,null,null,null,null,null,null,null,null,null,null,null,null,null,null,null,25,"",{"$error":"#VALUE!"},0,null,"",{"$error":"#VALUE!"},0,null,"",{"$error":"#VALUE!"},0,null,"",{"$error":"#VALUE!"},0,null,"",{"$error":"#VALUE!"},0]
[null,null,null,null,null,null,null,null,null,null,null,null,null,null,null,null,null,null,null,null,null,null,null,null,null,null,null,null,null,null,null,null,null,null,null,null,null,null,null,null,null,null,null,null,null,null,null,null,null,null,null,null,null,null,null,null,null,null,null,null,null,null,null,null,null,null,null,null,null,null,null,null,null,null,null,null,null,26,"",{"$error":"#VALUE!"},0,null,"",{"$error":"#VALUE!"},0,null,"",{"$error":"#VALUE!"},0,null,"",{"$error":"#VALUE!"},0,null,"",{"$error":"#VALUE!"},0]
[null,null,null,null,null,null,null,null,null,null,null,null,null,null,null,null,null,null,null,null,null,null,null,null,null,null,null,null,null,null,null,null,null,null,null,null,null,null,null,null,null,null,null,null,null,null,null,null,null,null,null,null,null,null,null,null,null,null,null,null,null,null,null,null,null,null,null,null,null,null,null,null,null,null,null,null,null,27,"",{"$error":"#VALUE!"},0,null,"",{"$error":"#VALUE!"},0,null,"",{"$error":"#VALUE!"},0,null,"",{"$error":"#VALUE!"},0,null,"",{"$error":"#VALUE!"},0]
[null,null,null,null,null,null,null,null,null,null,null,null,null,null,null,null,null,null,null,null,null,null,null,null,null,null,null,null,null,null,null,null,null,null,null,null,null,null,null,null,null,null,null,null,null,null,null,null,null,null,null,null,null,null,null,null,null,null,null,null,null,null,null,null,null,null,null,null,null,null,null,null,null,null,null,null,null,28,"",{"$error":"#VALUE!"},0,null,"",{"$error":"#VALUE!"},0,null,"",{"$error":"#VALUE!"},0,null,"",{"$error":"#VALUE!"},0,null,"",{"$error":"#VALUE!"},0]
[null,null,null,null,null,null,null,null,null,null,null,null,null,null,null,null,null,null,null,null,null,null,null,null,null,null,null,null,null,null,null,null,null,null,null,null,null,null,null,null,null,null,null,null,null,null,null,null,null,null,null,null,null,null,null,null,null,null,null,null,null,null,null,null,null,null,null,null,null,null,null,null,null,null,null,null,null,29,"",{"$error":"#VALUE!"},0,null,"",{"$error":"#VALUE!"},0,null,"",{"$error":"#VALUE!"},0,null,"",{"$error":"#VALUE!"},0,null,"",{"$error":"#VALUE!"},0]
[null,null,null,null,null,null,null,null,null,null,null,null,null,null,null,null,null,null,null,null,null,null,null,null,null,null,null,null,null,null,null,null,null,null,null,null,null,null,null,null,null,null,null,null,null,null,null,null,null,null,null,null,null,null,null,null,null,null,null,null,null,null,null,null,null,null,null,null,null,null,null,null,null,null,null,null,null,30,"",{"$error":"#VALUE!"},0,null,"",{"$error":"#VALUE!"},0,null,"",{"$error":"#VALUE!"},0,null,"",{"$error":"#VALUE!"},0,null,"",{"$error":"#VALUE!"},0]
[null,null,null,null,null,null,null,null,null,null,null,null,null,null,null,null,null,null,null,null,null,null,null,null,null,null,null,null,null,null,null,null,null,null,null,null,null,null,null,null,null,null,null,null,null,null,null,null,null,null,null,null,null,null,null,null,null,null,null,null,null,null,null,null,null,null,null,null,null,null,null,null,null,null,null,null,null,31,"",{"$error":"#VALUE!"},0,null,"",{"$error":"#VALUE!"},0,null,"",{"$error":"#VALUE!"},0,null,"",{"$error":"#VALUE!"},0,null,"",{"$error":"#VALUE!"},0]
[null,null,null,null,null,null,null,null,null,null,null,null,null,null,null,null,null,null,null,null,null,null,null,null,null,null,null,null,null,null,null,null,null,null,null,null,null,null,null,null,null,null,null,null,null,null,null,null,null,null,null,null,null,null,null,null,null,null,null,null,null,null,null,null,null,null,null,null,null,null,null,null,null,null,null,null,null,32,"",{"$error":"#VALUE!"},0,null,"",{"$error":"#VALUE!"},0,null,"",{"$error":"#VALUE!"},0,null,"",{"$error":"#VALUE!"},0,null,"",{"$error":"#VALUE!"},0]
[null,null,null,null,null,null,null,null,null,null,null,null,null,null,null,null,null,null,null,null,null,null,null,null,null,null,null,null,null,null,null,null,null,null,null,null,null,null,null,null,null,null,null,null,null,null,null,null,null,null,null,null,null,null,null,null,null,null,null,null,null,null,null,null,null,null,null,null,null,null,null,null,null,null,null,null,null,33,"",{"$f":"NORMDIST(CA133,_mn8,_sd8,0)","v":{"$error":"#VALUE!"}},0,null,"",{"$f":"NORMDIST(CE133,_mn200,_sd200,0)","v":{"$error":"#VALUE!"}},0,null,"",{"$f":"NORMDIST(CI133,_mnBC,_sdBC,0)","v":{"$error":"#VALUE!"}},0,null,"",{"$f":"NORMDIST(CM133,_mnMTD,_sdMTD,0)","v":{"$error":"#VALUE!"}},0,null,"",{"$f":"NORMDIST(CQ133,_mnAV,_sdAV,0)","v":{"$error":"#VALUE!"}},0]
[null,null,null,null,null,null,null,null,null,null,null,null,null,null,null,null,null,null,null,null,null,null,null,null,null,null,null,null,null,null,null,null,null,null,null,null,null,null,null,null,null,null,null,null,null,null,null,null,null,null,null,null,null,null,null,null,null,null,null,null,null,null,null,null,null,null,null,null,null,null,null,null,null,null,null,null,null,34,"",{"$error":"#VALUE!"},0,null,"",{"$error":"#VALUE!"},0,null,"",{"$error":"#VALUE!"},0,null,"",{"$error":"#VALUE!"},0,null,"",{"$error":"#VALUE!"},0]
[null,null,null,null,null,null,null,null,null,null,null,null,null,null,null,null,null,null,null,null,null,null,null,null,null,null,null,null,null,null,null,null,null,null,null,null,null,null,null,null,null,null,null,null,null,null,null,null,null,null,null,null,null,null,null,null,null,null,null,null,null,null,null,null,null,null,null,null,null,null,null,null,null,null,null,null,null,35,"",{"$error":"#VALUE!"},0,null,"",{"$error":"#VALUE!"},0,null,"",{"$error":"#VALUE!"},0,null,"",{"$error":"#VALUE!"},0,null,"",{"$error":"#VALUE!"},0]
[null,null,null,null,null,null,null,null,null,null,null,null,null,null,null,null,null,null,null,null,null,null,null,null,null,null,null,null,null,null,null,null,null,null,null,null,null,null,null,null,null,null,null,null,null,null,null,null,null,null,null,null,null,null,null,null,null,null,null,null,null,null,null,null,null,null,null,null,null,null,null,null,null,null,null,null,null,36,"",{"$error":"#VALUE!"},0,null,"",{"$error":"#VALUE!"},0,null,"",{"$error":"#VALUE!"},0,null,"",{"$error":"#VALUE!"},0,null,"",{"$error":"#VALUE!"},0]
[null,null,null,null,null,null,null,null,null,null,null,null,null,null,null,null,null,null,null,null,null,null,null,null,null,null,null,null,null,null,null,null,null,null,null,null,null,null,null,null,null,null,null,null,null,null,null,null,null,null,null,null,null,null,null,null,null,null,null,null,null,null,null,null,null,null,null,null,null,null,null,null,null,null,null,null,null,37,"",{"$error":"#VALUE!"},0,null,"",{"$error":"#VALUE!"},0,null,"",{"$error":"#VALUE!"},0,null,"",{"$error":"#VALUE!"},0,null,"",{"$error":"#VALUE!"},0]
[null,null,null,null,null,null,null,null,null,null,null,null,null,null,null,null,null,null,null,null,null,null,null,null,null,null,null,null,null,null,null,null,null,null,null,null,null,null,null,null,null,null,null,null,null,null,null,null,null,null,null,null,null,null,null,null,null,null,null,null,null,null,null,null,null,null,null,null,null,null,null,null,null,null,null,null,null,38,"",{"$error":"#VALUE!"},0,null,"",{"$error":"#VALUE!"},0,null,"",{"$error":"#VALUE!"},0,null,"",{"$error":"#VALUE!"},0,null,"",{"$error":"#VALUE!"},0]
[null,null,null,null,null,null,null,null,null,null,null,null,null,null,null,null,null,null,null,null,null,null,null,null,null,null,null,null,null,null,null,null,null,null,null,null,null,null,null,null,null,null,null,null,null,null,null,null,null,null,null,null,null,null,null,null,null,null,null,null,null,null,null,null,null,null,null,null,null,null,null,null,null,null,null,null,null,39,"",{"$error":"#VALUE!"},0,null,"",{"$error":"#VALUE!"},0,null,"",{"$error":"#VALUE!"},0,null,"",{"$error":"#VALUE!"},0,null,"",{"$error":"#VALUE!"},0]
[null,null,null,null,null,null,null,null,null,null,null,null,null,null,null,null,null,null,null,null,null,null,null,null,null,null,null,null,null,null,null,null,null,null,null,null,null,null,null,null,null,null,null,null,null,null,null,null,null,null,null,null,null,null,null,null,null,null,null,null,null,null,null,null,null,null,null,null,null,null,null,null,null,null,null,null,null,40,"",{"$error":"#VALUE!"},0,null,"",{"$error":"#VALUE!"},0,null,"",{"$error":"#VALUE!"},0,null,"",{"$error":"#VALUE!"},0,null,"",{"$error":"#VALUE!"},0]
[null,null,null,null,null,null,null,null,null,null,null,null,null,null,null,null,null,null,null,null,null,null,null,null,null,null,null,null,null,null,null,null,null,null,null,null,null,null,null,null,null,null,null,null,null,null,null,null,null,null,null,null,null,null,null,null,null,null,null,null,null,null,null,null,null,null,null,null,null,null,null,null,null,null,null,null,null,41,"",{"$error":"#VALUE!"},0,null,"",{"$error":"#VALUE!"},0,null,"",{"$error":"#VALUE!"},0,null,"",{"$error":"#VALUE!"},0,null,"",{"$error":"#VALUE!"},0]
[null,null,null,null,null,null,null,null,null,null,null,null,null,null,null,null,null,null,null,null,null,null,null,null,null,null,null,null,null,null,null,null,null,null,null,null,null,null,null,null,null,null,null,null,null,null,null,null,null,null,null,null,null,null,null,null,null,null,null,null,null,null,null,null,null,null,null,null,null,null,null,null,null,null,null,null,null,42,"",{"$error":"#VALUE!"},0,null,"",{"$error":"#VALUE!"},0,null,"",{"$error":"#VALUE!"},0,null,"",{"$error":"#VALUE!"},0,null,"",{"$error":"#VALUE!"},0]
[null,null,null,null,null,null,null,null,null,null,null,null,null,null,null,null,null,null,null,null,null,null,null,null,null,null,null,null,null,null,null,null,null,null,null,null,null,null,null,null,null,null,null,null,null,null,null,null,null,null,null,null,null,null,null,null,null,null,null,null,null,null,null,null,null,null,null,null,null,null,null,null,null,null,null,null,null,43,"",{"$error":"#VALUE!"},0,null,"",{"$error":"#VALUE!"},0,null,"",{"$error":"#VALUE!"},0,null,"",{"$error":"#VALUE!"},0,null,"",{"$error":"#VALUE!"},0]
[null,null,null,null,null,null,null,null,null,null,null,null,null,null,null,null,null,null,null,null,null,null,null,null,null,null,null,null,null,null,null,null,null,null,null,null,null,null,null,null,null,null,null,null,null,null,null,null,null,null,null,null,null,null,null,null,null,null,null,null,null,null,null,null,null,null,null,null,null,null,null,null,null,null,null,null,null,44,"",{"$error":"#VALUE!"},0,null,"",{"$error":"#VALUE!"},0,null,"",{"$error":"#VALUE!"},0,null,"",{"$error":"#VALUE!"},0,null,"",{"$error":"#VALUE!"},0]
[null,null,null,null,null,null,null,null,null,null,null,null,null,null,null,null,null,null,null,null,null,null,null,null,null,null,null,null,null,null,null,null,null,null,null,null,null,null,null,null,null,null,null,null,null,null,null,null,null,null,null,null,null,null,null,null,null,null,null,null,null,null,null,null,null,null,null,null,null,null,null,null,null,null,null,null,null,45,"",{"$error":"#VALUE!"},0,null,"",{"$error":"#VALUE!"},0,null,"",{"$error":"#VALUE!"},0,null,"",{"$error":"#VALUE!"},0,null,"",{"$error":"#VALUE!"},0]
[null,null,null,null,null,null,null,null,null,null,null,null,null,null,null,null,null,null,null,null,null,null,null,null,null,null,null,null,null,null,null,null,null,null,null,null,null,null,null,null,null,null,null,null,null,null,null,null,null,null,null,null,null,null,null,null,null,null,null,null,null,null,null,null,null,null,null,null,null,null,null,null,null,null,null,null,null,46,"",{"$error":"#VALUE!"},0,null,"",{"$error":"#VALUE!"},0,null,"",{"$error":"#VALUE!"},0,null,"",{"$error":"#VALUE!"},0,null,"",{"$error":"#VALUE!"},0]
[null,null,null,null,null,null,null,null,null,null,null,null,null,null,null,null,null,null,null,null,null,null,null,null,null,null,null,null,null,null,null,null,null,null,null,null,null,null,null,null,null,null,null,null,null,null,null,null,null,null,null,null,null,null,null,null,null,null,null,null,null,null,null,null,null,null,null,null,null,null,null,null,null,null,null,null,null,47,"",{"$error":"#VALUE!"},0,null,"",{"$error":"#VALUE!"},0,null,"",{"$error":"#VALUE!"},0,null,"",{"$error":"#VALUE!"},0,null,"",{"$error":"#VALUE!"},0]
[null,null,null,null,null,null,null,null,null,null,null,null,null,null,null,null,null,null,null,null,null,null,null,null,null,null,null,null,null,null,null,null,null,null,null,null,null,null,null,null,null,null,null,null,null,null,null,null,null,null,null,null,null,null,null,null,null,null,null,null,null,null,null,null,null,null,null,null,null,null,null,null,null,null,null,null,null,48,"",{"$error":"#VALUE!"},0,null,"",{"$error":"#VALUE!"},0,null,"",{"$error":"#VALUE!"},0,null,"",{"$error":"#VALUE!"},0,null,"",{"$error":"#VALUE!"},0]
[null,null,null,null,null,null,null,null,null,null,null,null,null,null,null,null,null,null,null,null,null,null,null,null,null,null,null,null,null,null,null,null,null,null,null,null,null,null,null,null,null,null,null,null,null,null,null,null,null,null,null,null,null,null,null,null,null,null,null,null,null,null,null,null,null,null,null,null,null,null,null,null,null,null,null,null,null,49,"",{"$error":"#VALUE!"},0,null,"",{"$error":"#VALUE!"},0,null,"",{"$error":"#VALUE!"},0,null,"",{"$error":"#VALUE!"},0,null,"",{"$error":"#VALUE!"},0]
[null,null,null,null,null,null,null,null,null,null,null,null,null,null,null,null,null,null,null,null,null,null,null,null,null,null,null,null,null,null,null,null,null,null,null,null,null,null,null,null,null,null,null,null,null,null,null,null,null,null,null,null,null,null,null,null,null,null,null,null,null,null,null,null,null,null,null,null,null,null,null,null,null,null,null,null,null,50,"",{"$error":"#VALUE!"},0,null,"",{"$error":"#VALUE!"},0,null,"",{"$error":"#VALUE!"},0,null,"",{"$error":"#VALUE!"},0,null,"",{"$error":"#VALUE!"},0]
[null,null,null,null,null,null,null,null,null,null,null,null,null,null,null,null,null,null,null,null,null,null,null,null,null,null,null,null,null,null,null,null,null,null,null,null,null,null,null,null,null,null,null,null,null,null,null,null,null,null,null,null,null,null,null,null,null,null,null,null,null,null,null,null,null,null,null,null,null,null,null,null,null,null,null,null,null,51,"",{"$error":"#VALUE!"},0,null,"",{"$error":"#VALUE!"},0,null,"",{"$error":"#VALUE!"},0,null,"",{"$error":"#VALUE!"},0,null,"",{"$error":"#VALUE!"},0]
[null,null,null,null,null,null,null,null,null,null,null,null,null,null,null,null,null,null,null,null,null,null,null,null,null,null,null,null,null,null,null,null,null,null,null,null,null,null,null,null,null,null,null,null,null,null,null,null,null,null,null,null,null,null,null,null,null,null,null,null,null,null,null,null,null,null,null,null,null,null,null,null,null,null,null,null,null,52,"",{"$error":"#VALUE!"},0,null,"",{"$error":"#VALUE!"},0,null,"",{"$error":"#VALUE!"},0,null,"",{"$error":"#VALUE!"},0,null,"",{"$error":"#VALUE!"},0]
[null,null,null,null,null,null,null,null,null,null,null,null,null,null,null,null,null,null,null,null,null,null,null,null,null,null,null,null,null,null,null,null,null,null,null,null,null,null,null,null,null,null,null,null,null,null,null,null,null,null,null,null,null,null,null,null,null,null,null,null,null,null,null,null,null,null,null,null,null,null,null,null,null,null,null,null,null,53,"",{"$error":"#VALUE!"},0,null,"",{"$error":"#VALUE!"},0,null,"",{"$error":"#VALUE!"},0,null,"",{"$error":"#VALUE!"},0,null,"",{"$error":"#VALUE!"},0]
[null,null,null,null,null,null,null,null,null,null,null,null,null,null,null,null,null,null,null,null,null,null,null,null,null,null,null,null,null,null,null,null,null,null,null,null,null,null,null,null,null,null,null,null,null,null,null,null,null,null,null,null,null,null,null,null,null,null,null,null,null,null,null,null,null,null,null,null,null,null,null,null,null,null,null,null,null,54,"",{"$error":"#VALUE!"},0,null,"",{"$error":"#VALUE!"},0,null,"",{"$error":"#VALUE!"},0,null,"",{"$error":"#VALUE!"},0,null,"",{"$error":"#VALUE!"},0]
[null,null,null,null,null,null,null,null,null,null,null,null,null,null,null,null,null,null,null,null,null,null,null,null,null,null,null,null,null,null,null,null,null,null,null,null,null,null,null,null,null,null,null,null,null,null,null,null,null,null,null,null,null,null,null,null,null,null,null,null,null,null,null,null,null,null,null,null,null,null,null,null,null,null,null,null,null,55,"",{"$error":"#VALUE!"},0,null,"",{"$error":"#VALUE!"},0,null,"",{"$error":"#VALUE!"},0,null,"",{"$error":"#VALUE!"},0,null,"",{"$error":"#VALUE!"},0]
[null,null,null,null,null,null,null,null,null,null,null,null,null,null,null,null,null,null,null,null,null,null,null,null,null,null,null,null,null,null,null,null,null,null,null,null,null,null,null,null,null,null,null,null,null,null,null,null,null,null,null,null,null,null,null,null,null,null,null,null,null,null,null,null,null,null,null,null,null,null,null,null,null,null,null,null,null,56,"",{"$error":"#VALUE!"},0,null,"",{"$error":"#VALUE!"},0,null,"",{"$error":"#VALUE!"},0,null,"",{"$error":"#VALUE!"},0,null,"",{"$error":"#VALUE!"},0]
[null,null,null,null,null,null,null,null,null,null,null,null,null,null,null,null,null,null,null,null,null,null,null,null,null,null,null,null,null,null,null,null,null,null,null,null,null,null,null,null,null,null,null,null,null,null,null,null,null,null,null,null,null,null,null,null,null,null,null,null,null,null,null,null,null,null,null,null,null,null,null,null,null,null,null,null,null,57,"",{"$error":"#VALUE!"},0,null,"",{"$error":"#VALUE!"},0,null,"",{"$error":"#VALUE!"},0,null,"",{"$error":"#VALUE!"},0,null,"",{"$error":"#VALUE!"},0]
[null,null,null,null,null,null,null,null,null,null,null,null,null,null,null,null,null,null,null,null,null,null,null,null,null,null,null,null,null,null,null,null,null,null,null,null,null,null,null,null,null,null,null,null,null,null,null,null,null,null,null,null,null,null,null,null,null,null,null,null,null,null,null,null,null,null,null,null,null,null,null,null,null,null,null,null,null,58,"",{"$error":"#VALUE!"},0,null,"",{"$error":"#VALUE!"},0,null,"",{"$error":"#VALUE!"},0,null,"",{"$error":"#VALUE!"},0,null,"",{"$error":"#VALUE!"},0]
[null,null,null,null,null,null,null,null,null,null,null,null,null,null,null,null,null,null,null,null,null,null,null,null,null,null,null,null,null,null,null,null,null,null,null,null,null,null,null,null,null,null,null,null,null,null,null,null,null,null,null,null,null,null,null,null,null,null,null,null,null,null,null,null,null,null,null,null,null,null,null,null,null,null,null,null,null,59,"",{"$error":"#VALUE!"},0,null,"",{"$error":"#VALUE!"},0,null,"",{"$error":"#VALUE!"},0,null,"",{"$error":"#VALUE!"},0,null,"",{"$error":"#VALUE!"},0]
[null,null,null,null,null,null,null,null,null,null,null,null,null,null,null,null,null,null,null,null,null,null,null,null,null,null,null,null,null,null,null,null,null,null,null,null,null,null,null,null,null,null,null,null,null,null,null,null,null,null,null,null,null,null,null,null,null,null,null,null,null,null,null,null,null,null,null,null,null,null,null,null,null,null,null,null,null,60,"",{"$error":"#VALUE!"},0,null,"",{"$error":"#VALUE!"},0,null,"",{"$error":"#VALUE!"},0,null,"",{"$error":"#VALUE!"},0,null,"",{"$error":"#VALUE!"},0]
[null,null,null,null,null,null,null,null,null,null,null,null,null,null,null,null,null,null,null,null,null,null,null,null,null,null,null,null,null,null,null,null,null,null,null,null,null,null,null,null,null,null,null,null,null,null,null,null,null,null,null,null,null,null,null,null,null,null,null,null,null,null,null,null,null,null,null,null,null,null,null,null,null,null,null,null,null,61,"",{"$error":"#VALUE!"},0,null,"",{"$error":"#VALUE!"},0,null,"",{"$error":"#VALUE!"},0,null,"",{"$error":"#VALUE!"},0,null,"",{"$error":"#VALUE!"},0]
[null,null,null,null,null,null,null,null,null,null,null,null,null,null,null,null,null,null,null,null,null,null,null,null,null,null,null,null,null,null,null,null,null,null,null,null,null,null,null,null,null,null,null,null,null,null,null,null,null,null,null,null,null,null,null,null,null,null,null,null,null,null,null,null,null,null,null,null,null,null,null,null,null,null,null,null,null,62,"",{"$error":"#VALUE!"},0,null,"",{"$error":"#VALUE!"},0,null,"",{"$error":"#VALUE!"},0,null,"",{"$error":"#VALUE!"},0,null,"",{"$error":"#VALUE!"},0]
[null,null,null,null,null,null,null,null,null,null,null,null,null,null,null,null,null,null,null,null,null,null,null,null,null,null,null,null,null,null,null,null,null,null,null,null,null,null,null,null,null,null,null,null,null,null,null,null,null,null,null,null,null,null,null,null,null,null,null,null,null,null,null,null,null,null,null,null,null,null,null,null,null,null,null,null,null,63,"",{"$error":"#VALUE!"},0,null,"",{"$error":"#VALUE!"},0,null,"",{"$error":"#VALUE!"},0,null,"",{"$error":"#VALUE!"},0,null,"",{"$error":"#VALUE!"},0]
[null,null,null,null,null,null,null,null,null,null,null,null,null,null,null,null,null,null,null,null,null,null,null,null,null,null,null,null,null,null,null,null,null,null,null,null,null,null,null,null,null,null,null,null,null,null,null,null,null,null,null,null,null,null,null,null,null,null,null,null,null,null,null,null,null,null,null,null,null,null,null,null,null,null,null,null,null,64,"",{"$error":"#VALUE!"},0,null,"",{"$error":"#VALUE!"},0,null,"",{"$error":"#VALUE!"},0,null,"",{"$error":"#VALUE!"},0,null,"",{"$error":"#VALUE!"},0]
[null,null,null,null,null,null,null,null,null,null,null,null,null,null,null,null,null,null,null,null,null,null,null,null,null,null,null,null,null,null,null,null,null,null,null,null,null,null,null,null,null,null,null,null,null,null,null,null,null,null,null,null,null,null,null,null,null,null,null,null,null,null,null,null,null,null,null,null,null,null,null,null,null,null,null,null,null,65,"",{"$f":"NORMDIST(CA165,_mn8,_sd8,0)","v":{"$error":"#VALUE!"}},0,null,"",{"$f":"NORMDIST(CE165,_mn200,_sd200,0)","v":{"$error":"#VALUE!"}},0,null,"",{"$f":"NORMDIST(CI165,_mnBC,_sdBC,0)","v":{"$error":"#VALUE!"}},0,null,"",{"$f":"NORMDIST(CM165,_mnMTD,_sdMTD,0)","v":{"$error":"#VALUE!"}},0,null,"",{"$f":"NORMDIST(CQ165,_mnAV,_sdAV,0)","v":{"$error":"#VALUE!"}},0]
[null,null,null,null,null,null,null,null,null,null,null,null,null,null,null,null,null,null,null,null,null,null,null,null,null,null,null,null,null,null,null,null,null,null,null,null,null,null,null,null,null,null,null,null,null,null,null,null,null,null,null,null,null,null,null,null,null,null,null,null,null,null,null,null,null,null,null,null,null,null,null,null,null,null,null,null,null,66,{"$f":"IF(ISNUMBER(CA$95),CA$95+(BZ166*CA$96),\"\")","v":""},{"$error":"#VALUE!"},{"$f":"IF(OR($BZ166=CC$91,$BZ166=CC$92),CC$93,0)","v":0},null,{"$f":"IF(ISNUMBER(CE$95),CE$95+(BZ166*CE$96),\"\")","v":""},{"$error":"#VALUE!"},{"$f":"IF(OR($BZ166=CG$91,$BZ166=CG$92),CG$93,0)","v":0},null,{"$f":"IF(ISNUMBER(CI$95),CI$95+($BZ166*CI$96),\"\")","v":""},{"$error":"#VALUE!"},{"$f":"IF(OR($BZ166=CK$91,$BZ166=CK$92),CK$93,0)","v":0},null,{"$f":"IF(ISNUMBER(CM$95),CM$95+($BZ166*CM$96),\"\")","v":""},{"$error":"#VALUE!"},{"$f":"IF(OR($BZ166=CO$91,$BZ166=CO$92),CO$93,0)","v":0},null,{"$f":"IF(ISNUMBER(CQ$95),CQ$95+($BZ166*CQ$96),\"\")","v":""},{"$error":"#VALUE!"},{"$f":"IF(OR($BZ166=CS$91,$BZ166=CS$92),CS$93,0)","v":0}]
[null,null,null,null,null,null,null,null,null,null,null,null,null,null,null,null,null,null,null,null,null,null,null,null,null,null,null,null,null,null,null,null,null,null,null,null,null,null,null,null,null,null,null,null,null,null,null,null,null,null,null,null,null,null,null,null,null,null,null,null,null,null,null,null,null,null,null,null,null,null,null,null,null,null,null,null,null,67,"",{"$error":"#VALUE!"},0,null,"",{"$error":"#VALUE!"},0,null,"",{"$error":"#VALUE!"},0,null,"",{"$error":"#VALUE!"},0,null,"",{"$error":"#VALUE!"},0]
[null,null,null,null,null,null,null,null,null,null,null,null,null,null,null,null,null,null,null,null,null,null,null,null,null,null,null,null,null,null,null,null,null,null,null,null,null,null,null,null,null,null,null,null,null,null,null,null,null,null,null,null,null,null,null,null,null,null,null,null,null,null,null,null,null,null,null,null,null,null,null,null,null,null,null,null,null,68,"",{"$error":"#VALUE!"},0,null,"",{"$error":"#VALUE!"},0,null,"",{"$error":"#VALUE!"},0,null,"",{"$error":"#VALUE!"},0,null,"",{"$error":"#VALUE!"},0]
[null,null,null,null,null,null,null,null,null,null,null,null,null,null,null,null,null,null,null,null,null,null,null,null,null,null,null,null,null,null,null,null,null,null,null,null,null,null,null,null,null,null,null,null,null,null,null,null,null,null,null,null,null,null,null,null,null,null,null,null,null,null,null,null,null,null,null,null,null,null,null,null,null,null,null,null,null,69,"",{"$error":"#VALUE!"},0,null,"",{"$error":"#VALUE!"},0,null,"",{"$error":"#VALUE!"},0,null,"",{"$error":"#VALUE!"},0,null,"",{"$error":"#VALUE!"},0]
[null,null,null,null,null,null,null,null,null,null,null,null,null,null,null,null,null,null,null,null,null,null,null,null,null,null,null,null,null,null,null,null,null,null,null,null,null,null,null,null,null,null,null,null,null,null,null,null,null,null,null,null,null,null,null,null,null,null,null,null,null,null,null,null,null,null,null,null,null,null,null,null,null,null,null,null,null,70,"",{"$error":"#VALUE!"},0,null,"",{"$error":"#VALUE!"},0,null,"",{"$error":"#VALUE!"},0,null,"",{"$error":"#VALUE!"},0,null,"",{"$error":"#VALUE!"},0]
[null,null,null,null,null,null,null,null,null,null,null,null,null,null,null,null,null,null,null,null,null,null,null,null,null,null,null,null,null,null,null,null,null,null,null,null,null,null,null,null,null,null,null,null,null,null,null,null,null,null,null,null,null,null,null,null,null,null,null,null,null,null,null,null,null,null,null,null,null,null,null,null,null,null,null,null,null,71,"",{"$error":"#VALUE!"},0,null,"",{"$error":"#VALUE!"},0,null,"",{"$error":"#VALUE!"},0,null,"",{"$error":"#VALUE!"},0,null,"",{"$error":"#VALUE!"},0]
[null,null,null,null,null,null,null,null,null,null,null,null,null,null,null,null,null,null,null,null,null,null,null,null,null,null,null,null,null,null,null,null,null,null,null,null,null,null,null,null,null,null,null,null,null,null,null,null,null,null,null,null,null,null,null,null,null,null,null,null,null,null,null,null,null,null,null,null,null,null,null,null,null,null,null,null,null,72,"",{"$error":"#VALUE!"},0,null,"",{"$error":"#VALUE!"},0,null,"",{"$error":"#VALUE!"},0,null,"",{"$error":"#VALUE!"},0,null,"",{"$error":"#VALUE!"},0]
[null,null,null,null,null,null,null,null,null,null,null,null,null,null,null,null,null,null,null,null,null,null,null,null,null,null,null,null,null,null,null,null,null,null,null,null,null,null,null,null,null,null,null,null,null,null,null,null,null,null,null,null,null,null,null,null,null,null,null,null,null,null,null,null,null,null,null,null,null,null,null,null,null,null,null,null,null,73,"",{"$error":"#VALUE!"},0,null,"",{"$error":"#VALUE!"},0,null,"",{"$error":"#VALUE!"},0,null,"",{"$error":"#VALUE!"},0,null,"",{"$error":"#VALUE!"},0]
[null,null,null,null,null,null,null,null,null,null,null,null,null,null,null,null,null,null,null,null,null,null,null,null,null,null,null,null,null,null,null,null,null,null,null,null,null,null,null,null,null,null,null,null,null,null,null,null,null,null,null,null,null,null,null,null,null,null,null,null,null,null,null,null,null,null,null,null,null,null,null,null,null,null,null,null,null,74,"",{"$error":"#VALUE!"},0,null,"",{"$error":"#VALUE!"},0,null,"",{"$error":"#VALUE!"},0,null,"",{"$error":"#VALUE!"},0,null,"",{"$error":"#VALUE!"},0]
[null,null,null,null,null,null,null,null,null,null,null,null,null,null,null,null,null,null,null,null,null,null,null,null,null,null,null,null,null,null,null,null,null,null,null,null,null,null,null,null,null,null,null,null,null,null,null,null,null,null,null,null,null,null,null,null,null,null,null,null,null,null,null,null,null,null,null,null,null,null,null,null,null,null,null,null,null,75,"",{"$error":"#VALUE!"},0,null,"",{"$error":"#VALUE!"},0,null,"",{"$error":"#VALUE!"},0,null,"",{"$error":"#VALUE!"},0,null,"",{"$error":"#VALUE!"},0]
[null,null,null,null,null,null,null,null,null,null,null,null,null,null,null,null,null,null,null,null,null,null,null,null,null,null,null,null,null,null,null,null,null,null,null,null,null,null,null,null,null,null,null,null,null,null,null,null,null,null,null,null,null,null,null,null,null,null,null,null,null,null,null,null,null,null,null,null,null,null,null,null,null,null,null,null,null,76,"",{"$error":"#VALUE!"},0,null,"",{"$error":"#VALUE!"},0,null,"",{"$error":"#VALUE!"},0,null,"",{"$error":"#VALUE!"},0,null,"",{"$error":"#VALUE!"},0]
[null,null,null,null,null,null,null,null,null,null,null,null,null,null,null,null,null,null,null,null,null,null,null,null,null,null,null,null,null,null,null,null,null,null,null,null,null,null,null,null,null,null,null,null,null,null,null,null,null,null,null,null,null,null,null,null,null,null,null,null,null,null,null,null,null,null,null,null,null,null,null,null,null,null,null,null,null,77,"",{"$error":"#VALUE!"},0,null,"",{"$error":"#VALUE!"},0,null,"",{"$error":"#VALUE!"},0,null,"",{"$error":"#VALUE!"},0,null,"",{"$error":"#VALUE!"},0]
[null,null,null,null,null,null,null,null,null,null,null,null,null,null,null,null,null,null,null,null,null,null,null,null,null,null,null,null,null,null,null,null,null,null,null,null,null,null,null,null,null,null,null,null,null,null,null,null,null,null,null,null,null,null,null,null,null,null,null,null,null,null,null,null,null,null,null,null,null,null,null,null,null,null,null,null,null,78,"",{"$error":"#VALUE!"},0,null,"",{"$error":"#VALUE!"},0,null,"",{"$error":"#VALUE!"},0,null,"",{"$error":"#VALUE!"},0,null,"",{"$error":"#VALUE!"},0]
[null,null,null,null,null,null,null,null,null,null,null,null,null,null,null,null,null,null,null,null,null,null,null,null,null,null,null,null,null,null,null,null,null,null,null,null,null,null,null,null,null,null,null,null,null,null,null,null,null,null,null,null,null,null,null,null,null,null,null,null,null,null,null,null,null,null,null,null,null,null,null,null,null,null,null,null,null,79,"",{"$error":"#VALUE!"},0,null,"",{"$error":"#VALUE!"},0,null,"",{"$error":"#VALUE!"},0,null,"",{"$error":"#VALUE!"},0,null,"",{"$error":"#VALUE!"},0]
[null,null,null,null,null,null,null,null,null,null,null,null,null,null,null,null,null,null,null,null,null,null,null,null,null,null,null,null,null,null,null,null,null,null,null,null,null,null,null,null,null,null,null,null,null,null,null,null,null,null,null,null,null,null,null,null,null,null,null,null,null,null,null,null,null,null,null,null,null,null,null,null,null,null,null,null,null,80,"",{"$error":"#VALUE!"},0,null,"",{"$error":"#VALUE!"},0,null,"",{"$error":"#VALUE!"},0,null,"",{"$error":"#VALUE!"},0,null,"",{"$error":"#VALUE!"},0]
[null,null,null,null,null,null,null,null,null,null,null,null,null,null,null,null,null,null,null,null,null,null,null,null,null,null,null,null,null,null,null,null,null,null,null,null,null,null,null,null,null,null,null,null,null,null,null,null,null,null,null,null,null,null,null,null,null,null,null,null,null,null,null,null,null,null,null,null,null,null,null,null,null,null,null,null,null,81,"",{"$error":"#VALUE!"},0,null,"",{"$error":"#VALUE!"},0,null,"",{"$error":"#VALUE!"},0,null,"",{"$error":"#VALUE!"},0,null,"",{"$error":"#VALUE!"},0]
[null,null,null,null,null,null,null,null,null,null,null,null,null,null,null,null,null,null,null,null,null,null,null,null,null,null,null,null,null,null,null,null,null,null,null,null,null,null,null,null,null,null,null,null,null,null,null,null,null,null,null,null,null,null,null,null,null,null,null,null,null,null,null,null,null,null,null,null,null,null,null,null,null,null,null,null,null,82,"",{"$error":"#VALUE!"},0,null,"",{"$error":"#VALUE!"},0,null,"",{"$error":"#VALUE!"},0,null,"",{"$error":"#VALUE!"},0,null,"",{"$error":"#VALUE!"},0]
[null,null,null,null,null,null,null,null,null,null,null,null,null,null,null,null,null,null,null,null,null,null,null,null,null,null,null,null,null,null,null,null,null,null,null,null,null,null,null,null,null,null,null,null,null,null,null,null,null,null,null,null,null,null,null,null,null,null,null,null,null,null,null,null,null,null,null,null,null,null,null,null,null,null,null,null,null,83,"",{"$error":"#VALUE!"},0,null,"",{"$error":"#VALUE!"},0,null,"",{"$error":"#VALUE!"},0,null,"",{"$error":"#VALUE!"},0,null,"",{"$error":"#VALUE!"},0]
[null,null,null,null,null,null,null,null,null,null,null,null,null,null,null,null,null,null,null,null,null,null,null,null,null,null,null,null,null,null,null,null,null,null,null,null,null,null,null,null,null,null,null,null,null,null,null,null,null,null,null,null,null,null,null,null,null,null,null,null,null,null,null,null,null,null,null,null,null,null,null,null,null,null,null,null,null,84,"",{"$error":"#VALUE!"},0,null,"",{"$error":"#VALUE!"},0,null,"",{"$error":"#VALUE!"},0,null,"",{"$error":"#VALUE!"},0,null,"",{"$error":"#VALUE!"},0]
[null,null,null,null,null,null,null,null,null,null,null,null,null,null,null,null,null,null,null,null,null,null,null,null,null,null,null,null,null,null,null,null,null,null,null,null,null,null,null,null,null,null,null,null,null,null,null,null,null,null,null,null,null,null,null,null,null,null,null,null,null,null,null,null,null,null,null,null,null,null,null,null,null,null,null,null,null,85,"",{"$error":"#VALUE!"},0,null,"",{"$error":"#VALUE!"},0,null,"",{"$error":"#VALUE!"},0,null,"",{"$error":"#VALUE!"},0,null,"",{"$error":"#VALUE!"},0]
[null,null,null,null,null,null,null,null,null,null,null,null,null,null,null,null,null,null,null,null,null,null,null,null,null,null,null,null,null,null,null,null,null,null,null,null,null,null,null,null,null,null,null,null,null,null,null,null,null,null,null,null,null,null,null,null,null,null,null,null,null,null,null,null,null,null,null,null,null,null,null,null,null,null,null,null,null,86,"",{"$error":"#VALUE!"},0,null,"",{"$error":"#VALUE!"},0,null,"",{"$error":"#VALUE!"},0,null,"",{"$error":"#VALUE!"},0,null,"",{"$error":"#VALUE!"},0]
[null,null,null,null,null,null,null,null,null,null,null,null,null,null,null,null,null,null,null,null,null,null,null,null,null,null,null,null,null,null,null,null,null,null,null,null,null,null,null,null,null,null,null,null,null,null,null,null,null,null,null,null,null,null,null,null,null,null,null,null,null,null,null,null,null,null,null,null,null,null,null,null,null,null,null,null,null,87,"",{"$error":"#VALUE!"},0,null,"",{"$error":"#VALUE!"},0,null,"",{"$error":"#VALUE!"},0,null,"",{"$error":"#VALUE!"},0,null,"",{"$error":"#VALUE!"},0]
[null,null,null,null,null,null,null,null,null,null,null,null,null,null,null,null,null,null,null,null,null,null,null,null,null,null,null,null,null,null,null,null,null,null,null,null,null,null,null,null,null,null,null,null,null,null,null,null,null,null,null,null,null,null,null,null,null,null,null,null,null,null,null,null,null,null,null,null,null,null,null,null,null,null,null,null,null,88,"",{"$error":"#VALUE!"},0,null,"",{"$error":"#VALUE!"},0,null,"",{"$error":"#VALUE!"},0,null,"",{"$error":"#VALUE!"},0,null,"",{"$error":"#VALUE!"},0]
[null,null,null,null,null,null,null,null,null,null,null,null,null,null,null,null,null,null,null,null,null,null,null,null,null,null,null,null,null,null,null,null,null,null,null,null,null,null,null,null,null,null,null,null,null,null,null,null,null,null,null,null,null,null,null,null,null,null,null,null,null,null,null,null,null,null,null,null,null,null,null,null,null,null,null,null,null,89,"",{"$error":"#VALUE!"},0,null,"",{"$error":"#VALUE!"},0,null,"",{"$error":"#VALUE!"},0,null,"",{"$error":"#VALUE!"},0,null,"",{"$error":"#VALUE!"},0]
[null,null,null,null,null,null,null,null,null,null,null,null,null,null,null,null,null,null,null,null,null,null,null,null,null,null,null,null,null,null,null,null,null,null,null,null,null,null,null,null,null,null,null,null,null,null,null,null,null,null,null,null,null,null,null,null,null,null,null,null,null,null,null,null,null,null,null,null,null,null,null,null,null,null,null,null,null,90,"",{"$error":"#VALUE!"},0,null,"",{"$error":"#VALUE!"},0,null,"",{"$error":"#VALUE!"},0,null,"",{"$error":"#VALUE!"},0,null,"",{"$error":"#VALUE!"},0]
[null,null,null,null,null,null,null,null,null,null,null,null,null,null,null,null,null,null,null,null,null,null,null,null,null,null,null,null,null,null,null,null,null,null,null,null,null,null,null,null,null,null,null,null,null,null,null,null,null,null,null,null,null,null,null,null,null,null,null,null,null,null,null,null,null,null,null,null,null,null,null,null,null,null,null,null,null,91,"",{"$error":"#VALUE!"},0,null,"",{"$error":"#VALUE!"},0,null,"",{"$error":"#VALUE!"},0,null,"",{"$error":"#VALUE!"},0,null,"",{"$error":"#VALUE!"},0]
[null,null,null,null,null,null,null,null,null,null,null,null,null,null,null,null,null,null,null,null,null,null,null,null,null,null,null,null,null,null,null,null,null,null,null,null,null,null,null,null,null,null,null,null,null,null,null,null,null,null,null,null,null,null,null,null,null,null,null,null,null,null,null,null,null,null,null,null,null,null,null,null,null,null,null,null,null,92,"",{"$error":"#VALUE!"},0,null,"",{"$error":"#VALUE!"},0,null,"",{"$error":"#VALUE!"},0,null,"",{"$error":"#VALUE!"},0,null,"",{"$error":"#VALUE!"},0]
[null,null,null,null,null,null,null,null,null,null,null,null,null,null,null,null,null,null,null,null,null,null,null,null,null,null,null,null,null,null,null,null,null,null,null,null,null,null,null,null,null,null,null,null,null,null,null,null,null,null,null,null,null,null,null,null,null,null,null,null,null,null,null,null,null,null,null,null,null,null,null,null,null,null,null,null,null,93,"",{"$error":"#VALUE!"},0,null,"",{"$error":"#VALUE!"},0,null,"",{"$error":"#VALUE!"},0,null,"",{"$error":"#VALUE!"},0,null,"",{"$error":"#VALUE!"},0]
[null,null,null,null,null,null,null,null,null,null,null,null,null,null,null,null,null,null,null,null,null,null,null,null,null,null,null,null,null,null,null,null,null,null,null,null,null,null,null,null,null,null,null,null,null,null,null,null,null,null,null,null,null,null,null,null,null,null,null,null,null,null,null,null,null,null,null,null,null,null,null,null,null,null,null,null,null,94,"",{"$error":"#VALUE!"},0,null,"",{"$error":"#VALUE!"},0,null,"",{"$error":"#VALUE!"},0,null,"",{"$error":"#VALUE!"},0,null,"",{"$error":"#VALUE!"},0]
[null,null,null,null,null,null,null,null,null,null,null,null,null,null,null,null,null,null,null,null,null,null,null,null,null,null,null,null,null,null,null,null,null,null,null,null,null,null,null,null,null,null,null,null,null,null,null,null,null,null,null,null,null,null,null,null,null,null,null,null,null,null,null,null,null,null,null,null,null,null,null,null,null,null,null,null,null,95,"",{"$error":"#VALUE!"},0,null,"",{"$error":"#VALUE!"},0,null,"",{"$error":"#VALUE!"},0,null,"",{"$error":"#VALUE!"},0,null,"",{"$error":"#VALUE!"},0]
[null,null,null,null,null,null,null,null,null,null,null,null,null,null,null,null,null,null,null,null,null,null,null,null,null,null,null,null,null,null,null,null,null,null,null,null,null,null,null,null,null,null,null,null,null,null,null,null,null,null,null,null,null,null,null,null,null,null,null,null,null,null,null,null,null,null,null,null,null,null,null,null,null,null,null,null,null,96,"",{"$error":"#VALUE!"},0,null,"",{"$error":"#VALUE!"},0,null,"",{"$error":"#VALUE!"},0,null,"",{"$error":"#VALUE!"},0,null,"",{"$error":"#VALUE!"},0]
[null,null,null,null,null,null,null,null,null,null,null,null,null,null,null,null,null,null,null,null,null,null,null,null,null,null,null,null,null,null,null,null,null,null,null,null,null,null,null,null,null,null,null,null,null,null,null,null,null,null,null,null,null,null,null,null,null,null,null,null,null,null,null,null,null,null,null,null,null,null,null,null,null,null,null,null,null,97,"",{"$f":"NORMDIST(CA197,_mn8,_sd8,0)","v":{"$error":"#VALUE!"}},0,null,"",{"$f":"NORMDIST(CE197,_mn200,_sd200,0)","v":{"$error":"#VALUE!"}},0,null,"",{"$f":"NORMDIST(CI197,_mnBC,_sdBC,0)","v":{"$error":"#VALUE!"}},0,null,"",{"$f":"NORMDIST(CM197,_mnMTD,_sdMTD,0)","v":{"$error":"#VALUE!"}},0,null,"",{"$f":"NORMDIST(CQ197,_mnAV,_sdAV,0)","v":{"$error":"#VALUE!"}},0]
[null,null,null,null,null,null,null,null,null,null,null,null,null,null,null,null,null,null,null,null,null,null,null,null,null,null,null,null,null,null,null,null,null,null,null,null,null,null,null,null,null,null,null,null,null,null,null,null,null,null,null,null,null,null,null,null,null,null,null,null,null,null,null,null,null,null,null,null,null,null,null,null,null,null,null,null,null,98,"",{"$error":"#VALUE!"},0,null,"",{"$error":"#VALUE!"},0,null,"",{"$error":"#VALUE!"},0,null,"",{"$error":"#VALUE!"},0,null,"",{"$error":"#VALUE!"},0]
[null,null,null,null,null,null,null,null,null,null,null,null,null,null,null,null,null,null,null,null,null,null,null,null,null,null,null,null,null,null,null,null,null,null,null,null,null,null,null,null,null,null,null,null,null,null,null,null,null,null,null,null,null,null,null,null,null,null,null,null,null,null,null,null,null,null,null,null,null,null,null,null,null,null,null,null,null,99,"",{"$error":"#VALUE!"},0,null,"",{"$error":"#VALUE!"},0,null,"",{"$error":"#VALUE!"},0,null,"",{"$error":"#VALUE!"},0,null,"",{"$error":"#VALUE!"},0]
[null,null,null,null,null,null,null,null,null,null,null,null,null,null,null,null,null,null,null,null,null,null,null,null,null,null,null,null,null,null,null,null,null,null,null,null,null,null,null,null,null,null,null,null,null,null,null,null,null,null,null,null,null,null,null,null,null,null,null,null,null,null,null,null,null,null,null,null,null,null,null,null,null,null,null,null,null,100,"",{"$error":"#VALUE!"},0,null,"",{"$error":"#VALUE!"},0,null,"",{"$error":"#VALUE!"},0,null,"",{"$error":"#VALUE!"},0,null,"",{"$error":"#VALUE!"},0]
[null,null,null,null,null,null,null,null,null,null,null,null,null,null,null,null,null,null,null,null,null,null,null,null,null,null,null,null,null,null,null,null,null,null,null,null,null,null,null,null,null,null,null,null,null,null,null,null,null,null,null,null,null,null,null,null,null,null,null,null,null,null,null,null,null,null,null,null,null,null,null,null,null,null,null,null,null,101,"",{"$error":"#VALUE!"},0,null,"",{"$error":"#VALUE!"},0,null,"",{"$error":"#VALUE!"},0,null,"",{"$error":"#VALUE!"},0,null,"",{"$error":"#VALUE!"},0]
[null,null,null,null,null,null,null,null,null,null,null,null,null,null,null,null,null,null,null,null,null,null,null,null,null,null,null,null,null,null,null,null,null,null,null,null,null,null,null,null,null,null,null,null,null,null,null,null,null,null,null,null,null,null,null,null,null,null,null,null,null,null,null,null,null,null,null,null,null,null,null,null,null,null,null,null,null,102,"",{"$error":"#VALUE!"},0,null,"",{"$error":"#VALUE!"},0,null,"",{"$error":"#VALUE!"},0,null,"",{"$error":"#VALUE!"},0,null,"",{"$error":"#VALUE!"},0]
[null,null,null,null,null,null,null,null,null,null,null,null,null,null,null,null,null,null,null,null,null,null,null,null,null,null,null,null,null,null,null,null,null,null,null,null,null,null,null,null,null,null,null,null,null,null,null,null,null,null,null,null,null,null,null,null,null,null,null,null,null,null,null,null,null,null,null,null,null,null,null,null,null,null,null,null,null,103,"",{"$error":"#VALUE!"},0,null,"",{"$error":"#VALUE!"},0,null,"",{"$error":"#VALUE!"},0,null,"",{"$error":"#VALUE!"},0,null,"",{"$error":"#VALUE!"},0]
[null,null,null,null,null,null,null,null,null,null,null,null,null,null,null,null,null,null,null,null,null,null,null,null,null,null,null,null,null,null,null,null,null,null,null,null,null,null,null,null,null,null,null,null,null,null,null,null,null,null,null,null,null,null,null,null,null,null,null,null,null,null,null,null,null,null,null,null,null,null,null,null,null,null,null,null,null,104,"",{"$error":"#VALUE!"},0,null,"",{"$error":"#VALUE!"},0,null,"",{"$error":"#VALUE!"},0,null,"",{"$error":"#VALUE!"},0,null,"",{"$error":"#VALUE!"},0]
[null,null,null,null,null,null,null,null,null,null,null,null,null,null,null,null,null,null,null,null,null,null,null,null,null,null,null,null,null,null,null,null,null,null,null,null,null,null,null,null,null,null,null,null,null,null,null,null,null,null,null,null,null,null,null,null,null,null,null,null,null,null,null,null,null,null,null,null,null,null,null,null,null,null,null,null,null,105,"",{"$error":"#VALUE!"},0,null,"",{"$error":"#VALUE!"},0,null,"",{"$error":"#VALUE!"},0,null,"",{"$error":"#VALUE!"},0,null,"",{"$error":"#VALUE!"},0]
[null,null,null,null,null,null,null,null,null,null,null,null,null,null,null,null,null,null,null,null,null,null,null,null,null,null,null,null,null,null,null,null,null,null,null,null,null,null,null,null,null,null,null,null,null,null,null,null,null,null,null,null,null,null,null,null,null,null,null,null,null,null,null,null,null,null,null,null,null,null,null,null,null,null,null,null,null,106,"",{"$error":"#VALUE!"},0,null,"",{"$error":"#VALUE!"},0,null,"",{"$error":"#VALUE!"},0,null,"",{"$error":"#VALUE!"},0,null,"",{"$error":"#VALUE!"},0]
[null,null,null,null,null,null,null,null,null,null,null,null,null,null,null,null,null,null,null,null,null,null,null,null,null,null,null,null,null,null,null,null,null,null,null,null,null,null,null,null,null,null,null,null,null,null,null,null,null,null,null,null,null,null,null,null,null,null,null,null,null,null,null,null,null,null,null,null,null,null,null,null,null,null,null,null,null,107,"",{"$error":"#VALUE!"},0,null,"",{"$error":"#VALUE!"},0,null,"",{"$error":"#VALUE!"},0,null,"",{"$error":"#VALUE!"},0,null,"",{"$error":"#VALUE!"},0]
[null,null,null,null,null,null,null,null,null,null,null,null,null,null,null,null,null,null,null,null,null,null,null,null,null,null,null,null,null,null,null,null,null,null,null,null,null,null,null,null,null,null,null,null,null,null,null,null,null,null,null,null,null,null,null,null,null,null,null,null,null,null,null,null,null,null,null,null,null,null,null,null,null,null,null,null,null,108,"",{"$error":"#VALUE!"},0,null,"",{"$error":"#VALUE!"},0,null,"",{"$error":"#VALUE!"},0,null,"",{"$error":"#VALUE!"},0,null,"",{"$error":"#VALUE!"},0]
[null,null,null,null,null,null,null,null,null,null,null,null,null,null,null,null,null,null,null,null,null,null,null,null,null,null,null,null,null,null,null,null,null,null,null,null,null,null,null,null,null,null,null,null,null,null,null,null,null,null,null,null,null,null,null,null,null,null,null,null,null,null,null,null,null,null,null,null,null,null,null,null,null,null,null,null,null,109,"",{"$error":"#VALUE!"},0,null,"",{"$error":"#VALUE!"},0,null,"",{"$error":"#VALUE!"},0,null,"",{"$error":"#VALUE!"},0,null,"",{"$error":"#VALUE!"},0]
[null,null,null,null,null,null,null,null,null,null,null,null,null,null,null,null,null,null,null,null,null,null,null,null,null,null,null,null,null,null,null,null,null,null,null,null,null,null,null,null,null,null,null,null,null,null,null,null,null,null,null,null,null,null,null,null,null,null,null,null,null,null,null,null,null,null,null,null,null,null,null,null,null,null,null,null,null,110,"",{"$error":"#VALUE!"},0,null,"",{"$error":"#VALUE!"},0,null,"",{"$error":"#VALUE!"},0,null,"",{"$error":"#VALUE!"},0,null,"",{"$error":"#VALUE!"},0]
[null,null,null,null,null,null,null,null,null,null,null,null,null,null,null,null,null,null,null,null,null,null,null,null,null,null,null,null,null,null,null,null,null,null,null,null,null,null,null,null,null,null,null,null,null,null,null,null,null,null,null,null,null,null,null,null,null,null,null,null,null,null,null,null,null,null,null,null,null,null,null,null,null,null,null,null,null,111,"",{"$error":"#VALUE!"},0,null,"",{"$error":"#VALUE!"},0,null,"",{"$error":"#VALUE!"},0,null,"",{"$error":"#VALUE!"},0,null,"",{"$error":"#VALUE!"},0]
[null,null,null,null,null,null,null,null,null,null,null,null,null,null,null,null,null,null,null,null,null,null,null,null,null,null,null,null,null,null,null,null,null,null,null,null,null,null,null,null,null,null,null,null,null,null,null,null,null,null,null,null,null,null,null,null,null,null,null,null,null,null,null,null,null,null,null,null,null,null,null,null,null,null,null,null,null,112,"",{"$error":"#VALUE!"},0,null,"",{"$error":"#VALUE!"},0,null,"",{"$error":"#VALUE!"},0,null,"",{"$error":"#VALUE!"},0,null,"",{"$error":"#VALUE!"},0]
[null,null,null,null,null,null,null,null,null,null,null,null,null,null,null,null,null,null,null,null,null,null,null,null,null,null,null,null,null,null,null,null,null,null,null,null,null,null,null,null,null,null,null,null,null,null,null,null,null,null,null,null,null,null,null,null,null,null,null,null,null,null,null,null,null,null,null,null,null,null,null,null,null,null,null,null,null,113,"",{"$error":"#VALUE!"},0,null,"",{"$error":"#VALUE!"},0,null,"",{"$error":"#VALUE!"},0,null,"",{"$error":"#VALUE!"},0,null,"",{"$error":"#VALUE!"},0]
[null,null,null,null,null,null,null,null,null,null,null,null,null,null,null,null,null,null,null,null,null,null,null,null,null,null,null,null,null,null,null,null,null,null,null,null,null,null,null,null,null,null,null,null,null,null,null,null,null,null,null,null,null,null,null,null,null,null,null,null,null,null,null,null,null,null,null,null,null,null,null,null,null,null,null,null,null,114,"",{"$error":"#VALUE!"},0,null,"",{"$error":"#VALUE!"},0,null,"",{"$error":"#VALUE!"},0,null,"",{"$error":"#VALUE!"},0,null,"",{"$error":"#VALUE!"},0]
[null,null,null,null,null,null,null,null,null,null,null,null,null,null,null,null,null,null,null,null,null,null,null,null,null,null,null,null,null,null,null,null,null,null,null,null,null,null,null,null,null,null,null,null,null,null,null,null,null,null,null,null,null,null,null,null,null,null,null,null,null,null,null,null,null,null,null,null,null,null,null,null,null,null,null,null,null,115,"",{"$error":"#VALUE!"},0,null,"",{"$error":"#VALUE!"},0,null,"",{"$error":"#VALUE!"},0,null,"",{"$error":"#VALUE!"},0,null,"",{"$error":"#VALUE!"},0]
[null,null,null,null,null,null,null,null,null,null,null,null,null,null,null,null,null,null,null,null,null,null,null,null,null,null,null,null,null,null,null,null,null,null,null,null,null,null,null,null,null,null,null,null,null,null,null,null,null,null,null,null,null,null,null,null,null,null,null,null,null,null,null,null,null,null,null,null,null,null,null,null,null,null,null,null,null,116,"",{"$error":"#VALUE!"},0,null,"",{"$error":"#VALUE!"},0,null,"",{"$error":"#VALUE!"},0,null,"",{"$error":"#VALUE!"},0,null,"",{"$error":"#VALUE!"},0]
[null,null,null,null,null,null,null,null,null,null,null,null,null,null,null,null,null,null,null,null,null,null,null,null,null,null,null,null,null,null,null,null,null,null,null,null,null,null,null,null,null,null,null,null,null,null,null,null,null,null,null,null,null,null,null,null,null,null,null,null,null,null,null,null,null,null,null,null,null,null,null,null,null,null,null,null,null,117,"",{"$error":"#VALUE!"},0,null,"",{"$error":"#VALUE!"},0,null,"",{"$error":"#VALUE!"},0,null,"",{"$error":"#VALUE!"},0,null,"",{"$error":"#VALUE!"},0]
[null,null,null,null,null,null,null,null,null,null,null,null,null,null,null,null,null,null,null,null,null,null,null,null,null,null,null,null,null,null,null,null,null,null,null,null,null,null,null,null,null,null,null,null,null,null,null,null,null,null,null,null,null,null,null,null,null,null,null,null,null,null,null,null,null,null,null,null,null,null,null,null,null,null,null,null,null,118,"",{"$error":"#VALUE!"},0,null,"",{"$error":"#VALUE!"},0,null,"",{"$error":"#VALUE!"},0,null,"",{"$error":"#VALUE!"},0,null,"",{"$error":"#VALUE!"},0]
[null,null,null,null,null,null,null,null,null,null,null,null,null,null,null,null,null,null,null,null,null,null,null,null,null,null,null,null,null,null,null,null,null,null,null,null,null,null,null,null,null,null,null,null,null,null,null,null,null,null,null,null,null,null,null,null,null,null,null,null,null,null,null,null,null,null,null,null,null,null,null,null,null,null,null,null,null,119,"",{"$error":"#VALUE!"},0,null,"",{"$error":"#VALUE!"},0,null,"",{"$error":"#VALUE!"},0,null,"",{"$error":"#VALUE!"},0,null,"",{"$error":"#VALUE!"},0]
[null,null,null,null,null,null,null,null,null,null,null,null,null,null,null,null,null,null,null,null,null,null,null,null,null,null,null,null,null,null,null,null,null,null,null,null,null,null,null,null,null,null,null,null,null,null,null,null,null,null,null,null,null,null,null,null,null,null,null,null,null,null,null,null,null,null,null,null,null,null,null,null,null,null,null,null,null,120,"",{"$error":"#VALUE!"},0,null,"",{"$error":"#VALUE!"},0,null,"",{"$error":"#VALUE!"},0,null,"",{"$error":"#VALUE!"},0,null,"",{"$error":"#VALUE!"},0]
[null,null,null,null,null,null,null,null,null,null,null,null,null,null,null,null,null,null,null,null,null,null,null,null,null,null,null,null,null,null,null,null,null,null,null,null,null,null,null,null,null,null,null,null,null,null,null,null,null,null,null,null,null,null,null,null,null,null,null,null,null,null,null,null,null,null,null,null,null,null,null,null,null,null,null,null,null,121,"",{"$error":"#VALUE!"},0,null,"",{"$error":"#VALUE!"},0,null,"",{"$error":"#VALUE!"},0,null,"",{"$error":"#VALUE!"},0,null,"",{"$error":"#VALUE!"},0]
[null,null,null,null,null,null,null,null,null,null,null,null,null,null,null,null,null,null,null,null,null,null,null,null,null,null,null,null,null,null,null,null,null,null,null,null,null,null,null,null,null,null,null,null,null,null,null,null,null,null,null,null,null,null,null,null,null,null,null,null,null,null,null,null,null,null,null,null,null,null,null,null,null,null,null,null,null,122,"",{"$error":"#VALUE!"},0,null,"",{"$error":"#VALUE!"},0,null,"",{"$error":"#VALUE!"},0,null,"",{"$error":"#VALUE!"},0,null,"",{"$error":"#VALUE!"},0]
[null,null,null,null,null,null,null,null,null,null,null,null,null,null,null,null,null,null,null,null,null,null,null,null,null,null,null,null,null,null,null,null,null,null,null,null,null,null,null,null,null,null,null,null,null,null,null,null,null,null,null,null,null,null,null,null,null,null,null,null,null,null,null,null,null,null,null,null,null,null,null,null,null,null,null,null,null,123,"",{"$error":"#VALUE!"},0,null,"",{"$error":"#VALUE!"},0,null,"",{"$error":"#VALUE!"},0,null,"",{"$error":"#VALUE!"},0,null,"",{"$error":"#VALUE!"},0]
[null,null,null,null,null,null,null,null,null,null,null,null,null,null,null,null,null,null,null,null,null,null,null,null,null,null,null,null,null,null,null,null,null,null,null,null,null,null,null,null,null,null,null,null,null,null,null,null,null,null,null,null,null,null,null,null,null,null,null,null,null,null,null,null,null,null,null,null,null,null,null,null,null,null,null,null,null,124,"",{"$error":"#VALUE!"},0,null,"",{"$error":"#VALUE!"},0,null,"",{"$error":"#VALUE!"},0,null,"",{"$error":"#VALUE!"},0,null,"",{"$error":"#VALUE!"},0]
[null,null,null,null,null,null,null,null,null,null,null,null,null,null,null,null,null,null,null,null,null,null,null,null,null,null,null,null,null,null,null,null,null,null,null,null,null,null,null,null,null,null,null,null,null,null,null,null,null,null,null,null,null,null,null,null,null,null,null,null,null,null,null,null,null,null,null,null,null,null,null,null,null,null,null,null,null,125,"",{"$error":"#VALUE!"},0,null,"",{"$error":"#VALUE!"},0,null,"",{"$error":"#VALUE!"},0,null,"",{"$error":"#VALUE!"},0,null,"",{"$error":"#VALUE!"},0]
[null,null,null,null,null,null,null,null,null,null,null,null,null,null,null,null,null,null,null,null,null,null,null,null,null,null,null,null,null,null,null,null,null,null,null,null,null,null,null,null,null,null,null,null,null,null,null,null,null,null,null,null,null,null,null,null,null,null,null,null,null,null,null,null,null,null,null,null,null,null,null,null,null,null,null,null,null,126,"",{"$error":"#VALUE!"},0,null,"",{"$error":"#VALUE!"},0,null,"",{"$error":"#VALUE!"},0,null,"",{"$error":"#VALUE!"},0,null,"",{"$error":"#VALUE!"},0]
[null,null,null,null,null,null,null,null,null,null,null,null,null,null,null,null,null,null,null,null,null,null,null,null,null,null,null,null,null,null,null,null,null,null,null,null,null,null,null,null,null,null,null,null,null,null,null,null,null,null,null,null,null,null,null,null,null,null,null,null,null,null,null,null,null,null,null,null,null,null,null,null,null,null,null,null,null,127,"",{"$error":"#VALUE!"},0,null,"",{"$error":"#VALUE!"},0,null,"",{"$error":"#VALUE!"},0,null,"",{"$error":"#VALUE!"},0,null,"",{"$error":"#VALUE!"},0]
[null,null,null,null,null,null,null,null,null,null,null,null,null,null,null,null,null,null,null,null,null,null,null,null,null,null,null,null,null,null,null,null,null,null,null,null,null,null,null,null,null,null,null,null,null,null,null,null,null,null,null,null,null,null,null,null,null,null,null,null,null,null,null,null,null,null,null,null,null,null,null,null,null,null,null,null,null,128,"",{"$error":"#VALUE!"},0,null,"",{"$error":"#VALUE!"},0,null,"",{"$error":"#VALUE!"},0,null,"",{"$error":"#VALUE!"},0,null,"",{"$error":"#VALUE!"},0]
[null,null,null,null,null,null,null,null,null,null,null,null,null,null,null,null,null,null,null,null,null,null,null,null,null,null,null,null,null,null,null,null,null,null,null,null,null,null,null,null,null,null,null,null,null,null,null,null,null,null,null,null,null,null,null,null,null,null,null,null,null,null,null,null,null,null,null,null,null,null,null,null,null,null,null,null,null,129,"",{"$f":"NORMDIST(CA229,_mn8,_sd8,0)","v":{"$error":"#VALUE!"}},0,null,"",{"$f":"NORMDIST(CE229,_mn200,_sd200,0)","v":{"$error":"#VALUE!"}},0,null,"",{"$f":"NORMDIST(CI229,_mnBC,_sdBC,0)","v":{"$error":"#VALUE!"}},0,null,"",{"$f":"NORMDIST(CM229,_mnMTD,_sdMTD,0)","v":{"$error":"#VALUE!"}},0,null,"",{"$f":"NORMDIST(CQ229,_mnAV,_sdAV,0)","v":{"$error":"#VALUE!"}},0]
[null,null,null,null,null,null,null,null,null,null,null,null,null,null,null,null,null,null,null,null,null,null,null,null,null,null,null,null,null,null,null,null,null,null,null,null,null,null,null,null,null,null,null,null,null,null,null,null,null,null,null,null,null,null,null,null,null,null,null,null,null,null,null,null,null,null,null,null,null,null,null,null,null,null,null,null,null,130,{"$f":"IF(ISNUMBER(CA$95),CA$95+(BZ230*CA$96),\"\")","v":""},{"$error":"#VALUE!"},{"$f":"IF(OR($BZ230=CC$91,$BZ230=CC$92),CC$93,0)","v":0},null,{"$f":"IF(ISNUMBER(CE$95),CE$95+(BZ230*CE$96),\"\")","v":""},{"$error":"#VALUE!"},{"$f":"IF(OR($BZ230=CG$91,$BZ230=CG$92),CG$93,0)","v":0},null,{"$f":"IF(ISNUMBER(CI$95),CI$95+($BZ230*CI$96),\"\")","v":""},{"$error":"#VALUE!"},{"$f":"IF(OR($BZ230=CK$91,$BZ230=CK$92),CK$93,0)","v":0},null,{"$f":"IF(ISNUMBER(CM$95),CM$95+($BZ230*CM$96),\"\")","v":""},{"$error":"#VALUE!"},{"$f":"IF(OR($BZ230=CO$91,$BZ230=CO$92),CO$93,0)","v":0},null,{"$f":"IF(ISNUMBER(CQ$95),CQ$95+($BZ230*CQ$96),\"\")","v":""},{"$error":"#VALUE!"},{"$f":"IF(OR($BZ230=CS$91,$BZ230=CS$92),CS$93,0)","v":0}]
[null,null,null,null,null,null,null,null,null,null,null,null,null,null,null,null,null,null,null,null,null,null,null,null,null,null,null,null,null,null,null,null,null,null,null,null,null,null,null,null,null,null,null,null,null,null,null,null,null,null,null,null,null,null,null,null,null,null,null,null,null,null,null,null,null,null,null,null,null,null,null,null,null,null,null,null,null,131,"",{"$error":"#VALUE!"},0,null,"",{"$error":"#VALUE!"},0,null,"",{"$error":"#VALUE!"},0,null,"",{"$error":"#VALUE!"},0,null,"",{"$error":"#VALUE!"},0]
[null,null,null,null,null,null,null,null,null,null,null,null,null,null,null,null,null,null,null,null,null,null,null,null,null,null,null,null,null,null,null,null,null,null,null,null,null,null,null,null,null,null,null,null,null,null,null,null,null,null,null,null,null,null,null,null,null,null,null,null,null,null,null,null,null,null,null,null,null,null,null,null,null,null,null,null,null,132,"",{"$error":"#VALUE!"},0,null,"",{"$error":"#VALUE!"},0,null,"",{"$error":"#VALUE!"},0,null,"",{"$error":"#VALUE!"},0,null,"",{"$error":"#VALUE!"},0]
[null,null,null,null,null,null,null,null,null,null,null,null,null,null,null,null,null,null,null,null,null,null,null,null,null,null,null,null,null,null,null,null,null,null,null,null,null,null,null,null,null,null,null,null,null,null,null,null,null,null,null,null,null,null,null,null,null,null,null,null,null,null,null,null,null,null,null,null,null,null,null,null,null,null,null,null,null,133,"",{"$error":"#VALUE!"},0,null,"",{"$error":"#VALUE!"},0,null,"",{"$error":"#VALUE!"},0,null,"",{"$error":"#VALUE!"},0,null,"",{"$error":"#VALUE!"},0]
[null,null,null,null,null,null,null,null,null,null,null,null,null,null,null,null,null,null,null,null,null,null,null,null,null,null,null,null,null,null,null,null,null,null,null,null,null,null,null,null,null,null,null,null,null,null,null,null,null,null,null,null,null,null,null,null,null,null,null,null,null,null,null,null,null,null,null,null,null,null,null,null,null,null,null,null,null,134,"",{"$error":"#VALUE!"},0,null,"",{"$error":"#VALUE!"},0,null,"",{"$error":"#VALUE!"},0,null,"",{"$error":"#VALUE!"},0,null,"",{"$error":"#VALUE!"},0]
[null,null,null,null,null,null,null,null,null,null,null,null,null,null,null,null,null,null,null,null,null,null,null,null,null,null,null,null,null,null,null,null,null,null,null,null,null,null,null,null,null,null,null,null,null,null,null,null,null,null,null,null,null,null,null,null,null,null,null,null,null,null,null,null,null,null,null,null,null,null,null,null,null,null,null,null,null,135,"",{"$error":"#VALUE!"},0,null,"",{"$error":"#VALUE!"},0,null,"",{"$error":"#VALUE!"},0,null,"",{"$error":"#VALUE!"},0,null,"",{"$error":"#VALUE!"},0]
[null,null,null,null,null,null,null,null,null,null,null,null,null,null,null,null,null,null,null,null,null,null,null,null,null,null,null,null,null,null,null,null,null,null,null,null,null,null,null,null,null,null,null,null,null,null,null,null,null,null,null,null,null,null,null,null,null,null,null,null,null,null,null,null,null,null,null,null,null,null,null,null,null,null,null,null,null,136,"",{"$error":"#VALUE!"},0,null,"",{"$error":"#VALUE!"},0,null,"",{"$error":"#VALUE!"},0,null,"",{"$error":"#VALUE!"},0,null,"",{"$error":"#VALUE!"},0]
[null,null,null,null,null,null,null,null,null,null,null,null,null,null,null,null,null,null,null,null,null,null,null,null,null,null,null,null,null,null,null,null,null,null,null,null,null,null,null,null,null,null,null,null,null,null,null,null,null,null,null,null,null,null,null,null,null,null,null,null,null,null,null,null,null,null,null,null,null,null,null,null,null,null,null,null,null,137,"",{"$error":"#VALUE!"},0,null,"",{"$error":"#VALUE!"},0,null,"",{"$error":"#VALUE!"},0,null,"",{"$error":"#VALUE!"},0,null,"",{"$error":"#VALUE!"},0]
[null,null,null,null,null,null,null,null,null,null,null,null,null,null,null,null,null,null,null,null,null,null,null,null,null,null,null,null,null,null,null,null,null,null,null,null,null,null,null,null,null,null,null,null,null,null,null,null,null,null,null,null,null,null,null,null,null,null,null,null,null,null,null,null,null,null,null,null,null,null,null,null,null,null,null,null,null,138,"",{"$error":"#VALUE!"},0,null,"",{"$error":"#VALUE!"},0,null,"",{"$error":"#VALUE!"},0,null,"",{"$error":"#VALUE!"},0,null,"",{"$error":"#VALUE!"},0]
[null,null,null,null,null,null,null,null,null,null,null,null,null,null,null,null,null,null,null,null,null,null,null,null,null,null,null,null,null,null,null,null,null,null,null,null,null,null,null,null,null,null,null,null,null,null,null,null,null,null,null,null,null,null,null,null,null,null,null,null,null,null,null,null,null,null,null,null,null,null,null,null,null,null,null,null,null,139,"",{"$error":"#VALUE!"},0,null,"",{"$error":"#VALUE!"},0,null,"",{"$error":"#VALUE!"},0,null,"",{"$error":"#VALUE!"},0,null,"",{"$error":"#VALUE!"},0]
[null,null,null,null,null,null,null,null,null,null,null,null,null,null,null,null,null,null,null,null,null,null,null,null,null,null,null,null,null,null,null,null,null,null,null,null,null,null,null,null,null,null,null,null,null,null,null,null,null,null,null,null,null,null,null,null,null,null,null,null,null,null,null,null,null,null,null,null,null,null,null,null,null,null,null,null,null,140,"",{"$error":"#VALUE!"},0,null,"",{"$error":"#VALUE!"},0,null,"",{"$error":"#VALUE!"},0,null,"",{"$error":"#VALUE!"},0,null,"",{"$error":"#VALUE!"},0]
[null,null,null,null,null,null,null,null,null,null,null,null,null,null,null,null,null,null,null,null,null,null,null,null,null,null,null,null,null,null,null,null,null,null,null,null,null,null,null,null,null,null,null,null,null,null,null,null,null,null,null,null,null,null,null,null,null,null,null,null,null,null,null,null,null,null,null,null,null,null,null,null,null,null,null,null,null,141,"",{"$error":"#VALUE!"},0,null,"",{"$error":"#VALUE!"},0,null,"",{"$error":"#VALUE!"},0,null,"",{"$error":"#VALUE!"},0,null,"",{"$error":"#VALUE!"},0]
[null,null,null,null,null,null,null,null,null,null,null,null,null,null,null,null,null,null,null,null,null,null,null,null,null,null,null,null,null,null,null,null,null,null,null,null,null,null,null,null,null,null,null,null,null,null,null,null,null,null,null,null,null,null,null,null,null,null,null,null,null,null,null,null,null,null,null,null,null,null,null,null,null,null,null,null,null,142,"",{"$error":"#VALUE!"},0,null,"",{"$error":"#VALUE!"},0,null,"",{"$error":"#VALUE!"},0,null,"",{"$error":"#VALUE!"},0,null,"",{"$error":"#VALUE!"},0]
[null,null,null,null,null,null,null,null,null,null,null,null,null,null,null,null,null,null,null,null,null,null,null,null,null,null,null,null,null,null,null,null,null,null,null,null,null,null,null,null,null,null,null,null,null,null,null,null,null,null,null,null,null,null,null,null,null,null,null,null,null,null,null,null,null,null,null,null,null,null,null,null,null,null,null,null,null,143,"",{"$error":"#VALUE!"},0,null,"",{"$error":"#VALUE!"},0,null,"",{"$error":"#VALUE!"},0,null,"",{"$error":"#VALUE!"},0,null,"",{"$error":"#VALUE!"},0]
[null,null,null,null,null,null,null,null,null,null,null,null,null,null,null,null,null,null,null,null,null,null,null,null,null,null,null,null,null,null,null,null,null,null,null,null,null,null,null,null,null,null,null,null,null,null,null,null,null,null,null,null,null,null,null,null,null,null,null,null,null,null,null,null,null,null,null,null,null,null,null,null,null,null,null,null,null,144,"",{"$error":"#VALUE!"},0,null,"",{"$error":"#VALUE!"},0,null,"",{"$error":"#VALUE!"},0,null,"",{"$error":"#VALUE!"},0,null,"",{"$error":"#VALUE!"},0]
[null,null,null,null,null,null,null,null,null,null,null,null,null,null,null,null,null,null,null,null,null,null,null,null,null,null,null,null,null,null,null,null,null,null,null,null,null,null,null,null,null,null,null,null,null,null,null,null,null,null,null,null,null,null,null,null,null,null,null,null,null,null,null,null,null,null,null,null,null,null,null,null,null,null,null,null,null,145,"",{"$error":"#VALUE!"},0,null,"",{"$error":"#VALUE!"},0,null,"",{"$error":"#VALUE!"},0,null,"",{"$error":"#VALUE!"},0,null,"",{"$error":"#VALUE!"},0]
[null,null,null,null,null,null,null,null,null,null,null,null,null,null,null,null,null,null,null,null,null,null,null,null,null,null,null,null,null,null,null,null,null,null,null,null,null,null,null,null,null,null,null,null,null,null,null,null,null,null,null,null,null,null,null,null,null,null,null,null,null,null,null,null,null,null,null,null,null,null,null,null,null,null,null,null,null,146,"",{"$error":"#VALUE!"},0,null,"",{"$error":"#VALUE!"},0,null,"",{"$error":"#VALUE!"},0,null,"",{"$error":"#VALUE!"},0,null,"",{"$error":"#VALUE!"},0]
[null,null,null,null,null,null,null,null,null,null,null,null,null,null,null,null,null,null,null,null,null,null,null,null,null,null,null,null,null,null,null,null,null,null,null,null,null,null,null,null,null,null,null,null,null,null,null,null,null,null,null,null,null,null,null,null,null,null,null,null,null,null,null,null,null,null,null,null,null,null,null,null,null,null,null,null,null,147,"",{"$error":"#VALUE!"},0,null,"",{"$error":"#VALUE!"},0,null,"",{"$error":"#VALUE!"},0,null,"",{"$error":"#VALUE!"},0,null,"",{"$error":"#VALUE!"},0]
[null,null,null,null,null,null,null,null,null,null,null,null,null,null,null,null,null,null,null,null,null,null,null,null,null,null,null,null,null,null,null,null,null,null,null,null,null,null,null,null,null,null,null,null,null,null,null,null,null,null,null,null,null,null,null,null,null,null,null,null,null,null,null,null,null,null,null,null,null,null,null,null,null,null,null,null,null,148,"",{"$error":"#VALUE!"},0,null,"",{"$error":"#VALUE!"},0,null,"",{"$error":"#VALUE!"},0,null,"",{"$error":"#VALUE!"},0,null,"",{"$error":"#VALUE!"},0]
[null,null,null,null,null,null,null,null,null,null,null,null,null,null,null,null,null,null,null,null,null,null,null,null,null,null,null,null,null,null,null,null,null,null,null,null,null,null,null,null,null,null,null,null,null,null,null,null,null,null,null,null,null,null,null,null,null,null,null,null,null,null,null,null,null,null,null,null,null,null,null,null,null,null,null,null,null,149,"",{"$error":"#VALUE!"},0,null,"",{"$error":"#VALUE!"},0,null,"",{"$error":"#VALUE!"},0,null,"",{"$error":"#VALUE!"},0,null,"",{"$error":"#VALUE!"},0]
[null,null,null,null,null,null,null,null,null,null,null,null,null,null,null,null,null,null,null,null,null,null,null,null,null,null,null,null,null,null,null,null,null,null,null,null,null,null,null,null,null,null,null,null,null,null,null,null,null,null,null,null,null,null,null,null,null,null,null,null,null,null,null,null,null,null,null,null,null,null,null,null,null,null,null,null,null,150,"",{"$error":"#VALUE!"},0,null,"",{"$error":"#VALUE!"},0,null,"",{"$error":"#VALUE!"},0,null,"",{"$error":"#VALUE!"},0,null,"",{"$error":"#VALUE!"},0]
[null,null,null,null,null,null,null,null,null,null,null,null,null,null,null,null,null,null,null,null,null,null,null,null,null,null,null,null,null,null,null,null,null,null,null,null,null,null,null,null,null,null,null,null,null,null,null,null,null,null,null,null,null,null,null,null,null,null,null,null,null,null,null,null,null,null,null,null,null,null,null,null,null,null,null,null,null,151,"",{"$error":"#VALUE!"},0,null,"",{"$error":"#VALUE!"},0,null,"",{"$error":"#VALUE!"},0,null,"",{"$error":"#VALUE!"},0,null,"",{"$error":"#VALUE!"},0]
[null,null,null,null,null,null,null,null,null,null,null,null,null,null,null,null,null,null,null,null,null,null,null,null,null,null,null,null,null,null,null,null,null,null,null,null,null,null,null,null,null,null,null,null,null,null,null,null,null,null,null,null,null,null,null,null,null,null,null,null,null,null,null,null,null,null,null,null,null,null,null,null,null,null,null,null,null,152,"",{"$error":"#VALUE!"},0,null,"",{"$error":"#VALUE!"},0,null,"",{"$error":"#VALUE!"},0,null,"",{"$error":"#VALUE!"},0,null,"",{"$error":"#VALUE!"},0]
[null,null,null,null,null,null,null,null,null,null,null,null,null,null,null,null,null,null,null,null,null,null,null,null,null,null,null,null,null,null,null,null,null,null,null,null,null,null,null,null,null,null,null,null,null,null,null,null,null,null,null,null,null,null,null,null,null,null,null,null,null,null,null,null,null,null,null,null,null,null,null,null,null,null,null,null,null,153,"",{"$error":"#VALUE!"},0,null,"",{"$error":"#VALUE!"},0,null,"",{"$error":"#VALUE!"},0,null,"",{"$error":"#VALUE!"},0,null,"",{"$error":"#VALUE!"},0]
[null,null,null,null,null,null,null,null,null,null,null,null,null,null,null,null,null,null,null,null,null,null,null,null,null,null,null,null,null,null,null,null,null,null,null,null,null,null,null,null,null,null,null,null,null,null,null,null,null,null,null,null,null,null,null,null,null,null,null,null,null,null,null,null,null,null,null,null,null,null,null,null,null,null,null,null,null,154,"",{"$error":"#VALUE!"},0,null,"",{"$error":"#VALUE!"},0,null,"",{"$error":"#VALUE!"},0,null,"",{"$error":"#VALUE!"},0,null,"",{"$error":"#VALUE!"},0]
[null,null,null,null,null,null,null,null,null,null,null,null,null,null,null,null,null,null,null,null,null,null,null,null,null,null,null,null,null,null,null,null,null,null,null,null,null,null,null,null,null,null,null,null,null,null,null,null,null,null,null,null,null,null,null,null,null,null,null,null,null,null,null,null,null,null,null,null,null,null,null,null,null,null,null,null,null,155,"",{"$error":"#VALUE!"},0,null,"",{"$error":"#VALUE!"},0,null,"",{"$error":"#VALUE!"},0,null,"",{"$error":"#VALUE!"},0,null,"",{"$error":"#VALUE!"},0]
[null,null,null,null,null,null,null,null,null,null,null,null,null,null,null,null,null,null,null,null,null,null,null,null,null,null,null,null,null,null,null,null,null,null,null,null,null,null,null,null,null,null,null,null,null,null,null,null,null,null,null,null,null,null,null,null,null,null,null,null,null,null,null,null,null,null,null,null,null,null,null,null,null,null,null,null,null,156,"",{"$error":"#VALUE!"},0,null,"",{"$error":"#VALUE!"},0,null,"",{"$error":"#VALUE!"},0,null,"",{"$error":"#VALUE!"},0,null,"",{"$error":"#VALUE!"},0]
[null,null,null,null,null,null,null,null,null,null,null,null,null,null,null,null,null,null,null,null,null,null,null,null,null,null,null,null,null,null,null,null,null,null,null,null,null,null,null,null,null,null,null,null,null,null,null,null,null,null,null,null,null,null,null,null,null,null,null,null,null,null,null,null,null,null,null,null,null,null,null,null,null,null,null,null,null,157,"",{"$error":"#VALUE!"},0,null,"",{"$error":"#VALUE!"},0,null,"",{"$error":"#VALUE!"},0,null,"",{"$error":"#VALUE!"},0,null,"",{"$error":"#VALUE!"},0]
[null,null,null,null,null,null,null,null,null,null,null,null,null,null,null,null,null,null,null,null,null,null,null,null,null,null,null,null,null,null,null,null,null,null,null,null,null,null,null,null,null,null,null,null,null,null,null,null,null,null,null,null,null,null,null,null,null,null,null,null,null,null,null,null,null,null,null,null,null,null,null,null,null,null,null,null,null,158,"",{"$error":"#VALUE!"},0,null,"",{"$error":"#VALUE!"},0,null,"",{"$error":"#VALUE!"},0,null,"",{"$error":"#VALUE!"},0,null,"",{"$error":"#VALUE!"},0]
[null,null,null,null,null,null,null,null,null,null,null,null,null,null,null,null,null,null,null,null,null,null,null,null,null,null,null,null,null,null,null,null,null,null,null,null,null,null,null,null,null,null,null,null,null,null,null,null,null,null,null,null,null,null,null,null,null,null,null,null,null,null,null,null,null,null,null,null,null,null,null,null,null,null,null,null,null,159,"",{"$error":"#VALUE!"},0,null,"",{"$error":"#VALUE!"},0,null,"",{"$error":"#VALUE!"},0,null,"",{"$error":"#VALUE!"},0,null,"",{"$error":"#VALUE!"},0]
[null,null,null,null,null,null,null,null,null,null,null,null,null,null,null,null,null,null,null,null,null,null,null,null,null,null,null,null,null,null,null,null,null,null,null,null,null,null,null,null,null,null,null,null,null,null,null,null,null,null,null,null,null,null,null,null,null,null,null,null,null,null,null,null,null,null,null,null,null,null,null,null,null,null,null,null,null,160,"",{"$error":"#VALUE!"},0,null,"",{"$error":"#VALUE!"},0,null,"",{"$error":"#VALUE!"},0,null,"",{"$error":"#VALUE!"},0,null,"",{"$error":"#VALUE!"},0]
[null,null,null,null,null,null,null,null,null,null,null,null,null,null,null,null,null,null,null,null,null,null,null,null,null,null,null,null,null,null,null,null,null,null,null,null,null,null,null,null,null,null,null,null,null,null,null,null,null,null,null,null,null,null,null,null,null,null,null,null,null,null,null,null,null,null,null,null,null,null,null,null,null,null,null,null,null,161,"",{"$f":"NORMDIST(CA261,_mn8,_sd8,0)","v":{"$error":"#VALUE!"}},0,null,"",{"$f":"NORMDIST(CE261,_mn200,_sd200,0)","v":{"$error":"#VALUE!"}},0,null,"",{"$f":"NORMDIST(CI261,_mnBC,_sdBC,0)","v":{"$error":"#VALUE!"}},0,null,"",{"$f":"NORMDIST(CM261,_mnMTD,_sdMTD,0)","v":{"$error":"#VALUE!"}},0,null,"",{"$f":"NORMDIST(CQ261,_mnAV,_sdAV,0)","v":{"$error":"#VALUE!"}},0]
[null,null,null,null,null,null,null,null,null,null,null,null,null,null,null,null,null,null,null,null,null,null,null,null,null,null,null,null,null,null,null,null,null,null,null,null,null,null,null,null,null,null,null,null,null,null,null,null,null,null,null,null,null,null,null,null,null,null,null,null,null,null,null,null,null,null,null,null,null,null,null,null,null,null,null,null,null,162,"",{"$error":"#VALUE!"},0,null,"",{"$error":"#VALUE!"},0,null,"",{"$error":"#VALUE!"},0,null,"",{"$error":"#VALUE!"},0,null,"",{"$error":"#VALUE!"},0]
[null,null,null,null,null,null,null,null,null,null,null,null,null,null,null,null,null,null,null,null,null,null,null,null,null,null,null,null,null,null,null,null,null,null,null,null,null,null,null,null,null,null,null,null,null,null,null,null,null,null,null,null,null,null,null,null,null,null,null,null,null,null,null,null,null,null,null,null,null,null,null,null,null,null,null,null,null,163,"",{"$error":"#VALUE!"},0,null,"",{"$error":"#VALUE!"},0,null,"",{"$error":"#VALUE!"},0,null,"",{"$error":"#VALUE!"},0,null,"",{"$error":"#VALUE!"},0]
[null,null,null,null,null,null,null,null,null,null,null,null,null,null,null,null,null,null,null,null,null,null,null,null,null,null,null,null,null,null,null,null,null,null,null,null,null,null,null,null,null,null,null,null,null,null,null,null,null,null,null,null,null,null,null,null,null,null,null,null,null,null,null,null,null,null,null,null,null,null,null,null,null,null,null,null,null,164,"",{"$error":"#VALUE!"},0,null,"",{"$error":"#VALUE!"},0,null,"",{"$error":"#VALUE!"},0,null,"",{"$error":"#VALUE!"},0,null,"",{"$error":"#VALUE!"},0]
[null,null,null,null,null,null,null,null,null,null,null,null,null,null,null,null,null,null,null,null,null,null,null,null,null,null,null,null,null,null,null,null,null,null,null,null,null,null,null,null,null,null,null,null,null,null,null,null,null,null,null,null,null,null,null,null,null,null,null,null,null,null,null,null,null,null,null,null,null,null,null,null,null,null,null,null,null,165,"",{"$error":"#VALUE!"},0,null,"",{"$error":"#VALUE!"},0,null,"",{"$error":"#VALUE!"},0,null,"",{"$error":"#VALUE!"},0,null,"",{"$error":"#VALUE!"},0]
[null,null,null,null,null,null,null,null,null,null,null,null,null,null,null,null,null,null,null,null,null,null,null,null,null,null,null,null,null,null,null,null,null,null,null,null,null,null,null,null,null,null,null,null,null,null,null,null,null,null,null,null,null,null,null,null,null,null,null,null,null,null,null,null,null,null,null,null,null,null,null,null,null,null,null,null,null,166,"",{"$error":"#VALUE!"},0,null,"",{"$error":"#VALUE!"},0,null,"",{"$error":"#VALUE!"},0,null,"",{"$error":"#VALUE!"},0,null,"",{"$error":"#VALUE!"},0]
[null,null,null,null,null,null,null,null,null,null,null,null,null,null,null,null,null,null,null,null,null,null,null,null,null,null,null,null,null,null,null,null,null,null,null,null,null,null,null,null,null,null,null,null,null,null,null,null,null,null,null,null,null,null,null,null,null,null,null,null,null,null,null,null,null,null,null,null,null,null,null,null,null,null,null,null,null,167,"",{"$error":"#VALUE!"},0,null,"",{"$error":"#VALUE!"},0,null,"",{"$error":"#VALUE!"},0,null,"",{"$error":"#VALUE!"},0,null,"",{"$error":"#VALUE!"},0]
[null,null,null,null,null,null,null,null,null,null,null,null,null,null,null,null,null,null,null,null,null,null,null,null,null,null,null,null,null,null,null,null,null,null,null,null,null,null,null,null,null,null,null,null,null,null,null,null,null,null,null,null,null,null,null,null,null,null,null,null,null,null,null,null,null,null,null,null,null,null,null,null,null,null,null,null,null,168,"",{"$error":"#VALUE!"},0,null,"",{"$error":"#VALUE!"},0,null,"",{"$error":"#VALUE!"},0,null,"",{"$error":"#VALUE!"},0,null,"",{"$error":"#VALUE!"},0]
[null,null,null,null,null,null,null,null,null,null,null,null,null,null,null,null,null,null,null,null,null,null,null,null,null,null,null,null,null,null,null,null,null,null,null,null,null,null,null,null,null,null,null,null,null,null,null,null,null,null,null,null,null,null,null,null,null,null,null,null,null,null,null,null,null,null,null,null,null,null,null,null,null,null,null,null,null,169,"",{"$error":"#VALUE!"},0,null,"",{"$error":"#VALUE!"},0,null,"",{"$error":"#VALUE!"},0,null,"",{"$error":"#VALUE!"},0,null,"",{"$error":"#VALUE!"},0]
[null,null,null,null,null,null,null,null,null,null,null,null,null,null,null,null,null,null,null,null,null,null,null,null,null,null,null,null,null,null,null,null,null,null,null,null,null,null,null,null,null,null,null,null,null,null,null,null,null,null,null,null,null,null,null,null,null,null,null,null,null,null,null,null,null,null,null,null,null,null,null,null,null,null,null,null,null,170,"",{"$error":"#VALUE!"},0,null,"",{"$error":"#VALUE!"},0,null,"",{"$error":"#VALUE!"},0,null,"",{"$error":"#VALUE!"},0,null,"",{"$error":"#VALUE!"},0]
[null,null,null,null,null,null,null,null,null,null,null,null,null,null,null,null,null,null,null,null,null,null,null,null,null,null,null,null,null,null,null,null,null,null,null,null,null,null,null,null,null,null,null,null,null,null,null,null,null,null,null,null,null,null,null,null,null,null,null,null,null,null,null,null,null,null,null,null,null,null,null,null,null,null,null,null,null,171,"",{"$error":"#VALUE!"},0,null,"",{"$error":"#VALUE!"},0,null,"",{"$error":"#VALUE!"},0,null,"",{"$error":"#VALUE!"},0,null,"",{"$error":"#VALUE!"},0]
[null,null,null,null,null,null,null,null,null,null,null,null,null,null,null,null,null,null,null,null,null,null,null,null,null,null,null,null,null,null,null,null,null,null,null,null,null,null,null,null,null,null,null,null,null,null,null,null,null,null,null,null,null,null,null,null,null,null,null,null,null,null,null,null,null,null,null,null,null,null,null,null,null,null,null,null,null,172,"",{"$error":"#VALUE!"},0,null,"",{"$error":"#VALUE!"},0,null,"",{"$error":"#VALUE!"},0,null,"",{"$error":"#VALUE!"},0,null,"",{"$error":"#VALUE!"},0]
[null,null,null,null,null,null,null,null,null,null,null,null,null,null,null,null,null,null,null,null,null,null,null,null,null,null,null,null,null,null,null,null,null,null,null,null,null,null,null,null,null,null,null,null,null,null,null,null,null,null,null,null,null,null,null,null,null,null,null,null,null,null,null,null,null,null,null,null,null,null,null,null,null,null,null,null,null,173,"",{"$error":"#VALUE!"},0,null,"",{"$error":"#VALUE!"},0,null,"",{"$error":"#VALUE!"},0,null,"",{"$error":"#VALUE!"},0,null,"",{"$error":"#VALUE!"},0]
[null,null,null,null,null,null,null,null,null,null,null,null,null,null,null,null,null,null,null,null,null,null,null,null,null,null,null,null,null,null,null,null,null,null,null,null,null,null,null,null,null,null,null,null,null,null,null,null,null,null,null,null,null,null,null,null,null,null,null,null,null,null,null,null,null,null,null,null,null,null,null,null,null,null,null,null,null,174,"",{"$error":"#VALUE!"},0,null,"",{"$error":"#VALUE!"},0,null,"",{"$error":"#VALUE!"},0,null,"",{"$error":"#VALUE!"},0,null,"",{"$error":"#VALUE!"},0]
[null,null,null,null,null,null,null,null,null,null,null,null,null,null,null,null,null,null,null,null,null,null,null,null,null,null,null,null,null,null,null,null,null,null,null,null,null,null,null,null,null,null,null,null,null,null,null,null,null,null,null,null,null,null,null,null,null,null,null,null,null,null,null,null,null,null,null,null,null,null,null,null,null,null,null,null,null,175,"",{"$error":"#VALUE!"},0,null,"",{"$error":"#VALUE!"},0,null,"",{"$error":"#VALUE!"},0,null,"",{"$error":"#VALUE!"},0,null,"",{"$error":"#VALUE!"},0]
[null,null,null,null,null,null,null,null,null,null,null,null,null,null,null,null,null,null,null,null,null,null,null,null,null,null,null,null,null,null,null,null,null,null,null,null,null,null,null,null,null,null,null,null,null,null,null,null,null,null,null,null,null,null,null,null,null,null,null,null,null,null,null,null,null,null,null,null,null,null,null,null,null,null,null,null,null,176,"",{"$error":"#VALUE!"},0,null,"",{"$error":"#VALUE!"},0,null,"",{"$error":"#VALUE!"},0,null,"",{"$error":"#VALUE!"},0,null,"",{"$error":"#VALUE!"},0]
[null,null,null,null,null,null,null,null,null,null,null,null,null,null,null,null,null,null,null,null,null,null,null,null,null,null,null,null,null,null,null,null,null,null,null,null,null,null,null,null,null,null,null,null,null,null,null,null,null,null,null,null,null,null,null,null,null,null,null,null,null,null,null,null,null,null,null,null,null,null,null,null,null,null,null,null,null,177,"",{"$error":"#VALUE!"},0,null,"",{"$error":"#VALUE!"},0,null,"",{"$error":"#VALUE!"},0,null,"",{"$error":"#VALUE!"},0,null,"",{"$error":"#VALUE!"},0]
[null,null,null,null,null,null,null,null,null,null,null,null,null,null,null,null,null,null,null,null,null,null,null,null,null,null,null,null,null,null,null,null,null,null,null,null,null,null,null,null,null,null,null,null,null,null,null,null,null,null,null,null,null,null,null,null,null,null,null,null,null,null,null,null,null,null,null,null,null,null,null,null,null,null,null,null,null,178,"",{"$error":"#VALUE!"},0,null,"",{"$error":"#VALUE!"},0,null,"",{"$error":"#VALUE!"},0,null,"",{"$error":"#VALUE!"},0,null,"",{"$error":"#VALUE!"},0]
[null,null,null,null,null,null,null,null,null,null,null,null,null,null,null,null,null,null,null,null,null,null,null,null,null,null,null,null,null,null,null,null,null,null,null,null,null,null,null,null,null,null,null,null,null,null,null,null,null,null,null,null,null,null,null,null,null,null,null,null,null,null,null,null,null,null,null,null,null,null,null,null,null,null,null,null,null,179,"",{"$error":"#VALUE!"},0,null,"",{"$error":"#VALUE!"},0,null,"",{"$error":"#VALUE!"},0,null,"",{"$error":"#VALUE!"},0,null,"",{"$error":"#VALUE!"},0]
[null,null,null,null,null,null,null,null,null,null,null,null,null,null,null,null,null,null,null,null,null,null,null,null,null,null,null,null,null,null,null,null,null,null,null,null,null,null,null,null,null,null,null,null,null,null,null,null,null,null,null,null,null,null,null,null,null,null,null,null,null,null,null,null,null,null,null,null,null,null,null,null,null,null,null,null,null,180,"",{"$error":"#VALUE!"},0,null,"",{"$error":"#VALUE!"},0,null,"",{"$error":"#VALUE!"},0,null,"",{"$error":"#VALUE!"},0,null,"",{"$error":"#VALUE!"},0]
[null,null,null,null,null,null,null,null,null,null,null,null,null,null,null,null,null,null,null,null,null,null,null,null,null,null,null,null,null,null,null,null,null,null,null,null,null,null,null,null,null,null,null,null,null,null,null,null,null,null,null,null,null,null,null,null,null,null,null,null,null,null,null,null,null,null,null,null,null,null,null,null,null,null,null,null,null,181,"",{"$error":"#VALUE!"},0,null,"",{"$error":"#VALUE!"},0,null,"",{"$error":"#VALUE!"},0,null,"",{"$error":"#VALUE!"},0,null,"",{"$error":"#VALUE!"},0]
[null,null,null,null,null,null,null,null,null,null,null,null,null,null,null,null,null,null,null,null,null,null,null,null,null,null,null,null,null,null,null,null,null,null,null,null,null,null,null,null,null,null,null,null,null,null,null,null,null,null,null,null,null,null,null,null,null,null,null,null,null,null,null,null,null,null,null,null,null,null,null,null,null,null,null,null,null,182,"",{"$error":"#VALUE!"},0,null,"",{"$error":"#VALUE!"},0,null,"",{"$error":"#VALUE!"},0,null,"",{"$error":"#VALUE!"},0,null,"",{"$error":"#VALUE!"},0]
[null,null,null,null,null,null,null,null,null,null,null,null,null,null,null,null,null,null,null,null,null,null,null,null,null,null,null,null,null,null,null,null,null,null,null,null,null,null,null,null,null,null,null,null,null,null,null,null,null,null,null,null,null,null,null,null,null,null,null,null,null,null,null,null,null,null,null,null,null,null,null,null,null,null,null,null,null,183,"",{"$error":"#VALUE!"},0,null,"",{"$error":"#VALUE!"},0,null,"",{"$error":"#VALUE!"},0,null,"",{"$error":"#VALUE!"},0,null,"",{"$error":"#VALUE!"},0]
[null,null,null,null,null,null,null,null,null,null,null,null,null,null,null,null,null,null,null,null,null,null,null,null,null,null,null,null,null,null,null,null,null,null,null,null,null,null,null,null,null,null,null,null,null,null,null,null,null,null,null,null,null,null,null,null,null,null,null,null,null,null,null,null,null,null,null,null,null,null,null,null,null,null,null,null,null,184,"",{"$error":"#VALUE!"},0,null,"",{"$error":"#VALUE!"},0,null,"",{"$error":"#VALUE!"},0,null,"",{"$error":"#VALUE!"},0,null,"",{"$error":"#VALUE!"},0]
[null,null,null,null,null,null,null,null,null,null,null,null,null,null,null,null,null,null,null,null,null,null,null,null,null,null,null,null,null,null,null,null,null,null,null,null,null,null,null,null,null,null,null,null,null,null,null,null,null,null,null,null,null,null,null,null,null,null,null,null,null,null,null,null,null,null,null,null,null,null,null,null,null,null,null,null,null,185,"",{"$error":"#VALUE!"},0,null,"",{"$error":"#VALUE!"},0,null,"",{"$error":"#VALUE!"},0,null,"",{"$error":"#VALUE!"},0,null,"",{"$error":"#VALUE!"},0]
[null,null,null,null,null,null,null,null,null,null,null,null,null,null,null,null,null,null,null,null,null,null,null,null,null,null,null,null,null,null,null,null,null,null,null,null,null,null,null,null,null,null,null,null,null,null,null,null,null,null,null,null,null,null,null,null,null,null,null,null,null,null,null,null,null,null,null,null,null,null,null,null,null,null,null,null,null,186,"",{"$error":"#VALUE!"},0,null,"",{"$error":"#VALUE!"},0,null,"",{"$error":"#VALUE!"},0,null,"",{"$error":"#VALUE!"},0,null,"",{"$error":"#VALUE!"},0]
[null,null,null,null,null,null,null,null,null,null,null,null,null,null,null,null,null,null,null,null,null,null,null,null,null,null,null,null,null,null,null,null,null,null,null,null,null,null,null,null,null,null,null,null,null,null,null,null,null,null,null,null,null,null,null,null,null,null,null,null,null,null,null,null,null,null,null,null,null,null,null,null,null,null,null,null,null,187,"",{"$error":"#VALUE!"},0,null,"",{"$error":"#VALUE!"},0,null,"",{"$error":"#VALUE!"},0,null,"",{"$error":"#VALUE!"},0,null,"",{"$error":"#VALUE!"},0]
[null,null,null,null,null,null,null,null,null,null,null,null,null,null,null,null,null,null,null,null,null,null,null,null,null,null,null,null,null,null,null,null,null,null,null,null,null,null,null,null,null,null,null,null,null,null,null,null,null,null,null,null,null,null,null,null,null,null,null,null,null,null,null,null,null,null,null,null,null,null,null,null,null,null,null,null,null,188,"",{"$error":"#VALUE!"},0,null,"",{"$error":"#VALUE!"},0,null,"",{"$error":"#VALUE!"},0,null,"",{"$error":"#VALUE!"},0,null,"",{"$error":"#VALUE!"},0]
[null,null,null,null,null,null,null,null,null,null,null,null,null,null,null,null,null,null,null,null,null,null,null,null,null,null,null,null,null,null,null,null,null,null,null,null,null,null,null,null,null,null,null,null,null,null,null,null,null,null,null,null,null,null,null,null,null,null,null,null,null,null,null,null,null,null,null,null,null,null,null,null,null,null,null,null,null,189,"",{"$error":"#VALUE!"},0,null,"",{"$error":"#VALUE!"},0,null,"",{"$error":"#VALUE!"},0,null,"",{"$error":"#VALUE!"},0,null,"",{"$error":"#VALUE!"},0]
[null,null,null,null,null,null,null,null,null,null,null,null,null,null,null,null,null,null,null,null,null,null,null,null,null,null,null,null,null,null,null,null,null,null,null,null,null,null,null,null,null,null,null,null,null,null,null,null,null,null,null,null,null,null,null,null,null,null,null,null,null,null,null,null,null,null,null,null,null,null,null,null,null,null,null,null,null,190,"",{"$error":"#VALUE!"},0,null,"",{"$error":"#VALUE!"},0,null,"",{"$error":"#VALUE!"},0,null,"",{"$error":"#VALUE!"},0,null,"",{"$error":"#VALUE!"},0]
[null,null,null,null,null,null,null,null,null,null,null,null,null,null,null,null,null,null,null,null,null,null,null,null,null,null,null,null,null,null,null,null,null,null,null,null,null,null,null,null,null,null,null,null,null,null,null,null,null,null,null,null,null,null,null,null,null,null,null,null,null,null,null,null,null,null,null,null,null,null,null,null,null,null,null,null,null,191,"",{"$error":"#VALUE!"},0,null,"",{"$error":"#VALUE!"},0,null,"",{"$error":"#VALUE!"},0,null,"",{"$error":"#VALUE!"},0,null,"",{"$error":"#VALUE!"},0]
[null,null,null,null,null,null,null,null,null,null,null,null,null,null,null,null,null,null,null,null,null,null,null,null,null,null,null,null,null,null,null,null,null,null,null,null,null,null,null,null,null,null,null,null,null,null,null,null,null,null,null,null,null,null,null,null,null,null,null,null,null,null,null,null,null,null,null,null,null,null,null,null,null,null,null,null,null,192,"",{"$error":"#VALUE!"},0,null,"",{"$error":"#VALUE!"},0,null,"",{"$error":"#VALUE!"},0,null,"",{"$error":"#VALUE!"},0,null,"",{"$error":"#VALUE!"},0]
[null,null,null,null,null,null,null,null,null,null,null,null,null,null,null,null,null,null,null,null,null,null,null,null,null,null,null,null,null,null,null,null,null,null,null,null,null,null,null,null,null,null,null,null,null,null,null,null,null,null,null,null,null,null,null,null,null,null,null,null,null,null,null,null,null,null,null,null,null,null,null,null,null,null,null,null,null,193,"",{"$f":"NORMDIST(CA293,_mn8,_sd8,0)","v":{"$error":"#VALUE!"}},0,null,"",{"$f":"NORMDIST(CE293,_mn200,_sd200,0)","v":{"$error":"#VALUE!"}},0,null,"",{"$f":"NORMDIST(CI293,_mnBC,_sdBC,0)","v":{"$error":"#VALUE!"}},0,null,"",{"$f":"NORMDIST(CM293,_mnMTD,_sdMTD,0)","v":{"$error":"#VALUE!"}},0,null,"",{"$f":"NORMDIST(CQ293,_mnAV,_sdAV,0)","v":{"$error":"#VALUE!"}},0]
[null,null,null,null,null,null,null,null,null,null,null,null,null,null,null,null,null,null,null,null,null,null,null,null,null,null,null,null,null,null,null,null,null,null,null,null,null,null,null,null,null,null,null,null,null,null,null,null,null,null,null,null,null,null,null,null,null,null,null,null,null,null,null,null,null,null,null,null,null,null,null,null,null,null,null,null,null,194,{"$f":"IF(ISNUMBER(CA$95),CA$95+(BZ294*CA$96),\"\")","v":""},{"$error":"#VALUE!"},{"$f":"IF(OR($BZ294=CC$91,$BZ294=CC$92),CC$93,0)","v":0},null,{"$f":"IF(ISNUMBER(CE$95),CE$95+(BZ294*CE$96),\"\")","v":""},{"$error":"#VALUE!"},{"$f":"IF(OR($BZ294=CG$91,$BZ294=CG$92),CG$93,0)","v":0},null,{"$f":"IF(ISNUMBER(CI$95),CI$95+($BZ294*CI$96),\"\")","v":""},{"$error":"#VALUE!"},{"$f":"IF(OR($BZ294=CK$91,$BZ294=CK$92),CK$93,0)","v":0},null,{"$f":"IF(ISNUMBER(CM$95),CM$95+($BZ294*CM$96),\"\")","v":""},{"$error":"#VALUE!"},{"$f":"IF(OR($BZ294=CO$91,$BZ294=CO$92),CO$93,0)","v":0},null,{"$f":"IF(ISNUMBER(CQ$95),CQ$95+($BZ294*CQ$96),\"\")","v":""},{"$error":"#VALUE!"},{"$f":"IF(OR($BZ294=CS$91,$BZ294=CS$92),CS$93,0)","v":0}]
[null,null,null,null,null,null,null,null,null,null,null,null,null,null,null,null,null,null,null,null,null,null,null,null,null,null,null,null,null,null,null,null,null,null,null,null,null,null,null,null,null,null,null,null,null,null,null,null,null,null,null,null,null,null,null,null,null,null,null,null,null,null,null,null,null,null,null,null,null,null,null,null,null,null,null,null,null,195,"",{"$error":"#VALUE!"},0,null,"",{"$error":"#VALUE!"},0,null,"",{"$error":"#VALUE!"},0,null,"",{"$error":"#VALUE!"},0,null,"",{"$error":"#VALUE!"},0]
[null,null,null,null,null,null,null,null,null,null,null,null,null,null,null,null,null,null,null,null,null,null,null,null,null,null,null,null,null,null,null,null,null,null,null,null,null,null,null,null,null,null,null,null,null,null,null,null,null,null,null,null,null,null,null,null,null,null,null,null,null,null,null,null,null,null,null,null,null,null,null,null,null,null,null,null,null,196,"",{"$error":"#VALUE!"},0,null,"",{"$error":"#VALUE!"},0,null,"",{"$error":"#VALUE!"},0,null,"",{"$error":"#VALUE!"},0,null,"",{"$error":"#VALUE!"},0]
[null,null,null,null,null,null,null,null,null,null,null,null,null,null,null,null,null,null,null,null,null,null,null,null,null,null,null,null,null,null,null,null,null,null,null,null,null,null,null,null,null,null,null,null,null,null,null,null,null,null,null,null,null,null,null,null,null,null,null,null,null,null,null,null,null,null,null,null,null,null,null,null,null,null,null,null,null,197,"",{"$error":"#VALUE!"},0,null,"",{"$error":"#VALUE!"},0,null,"",{"$error":"#VALUE!"},0,null,"",{"$error":"#VALUE!"},0,null,"",{"$error":"#VALUE!"},0]
[null,null,null,null,null,null,null,null,null,null,null,null,null,null,null,null,null,null,null,null,null,null,null,null,null,null,null,null,null,null,null,null,null,null,null,null,null,null,null,null,null,null,null,null,null,null,null,null,null,null,null,null,null,null,null,null,null,null,null,null,null,null,null,null,null,null,null,null,null,null,null,null,null,null,null,null,null,198,"",{"$error":"#VALUE!"},0,null,"",{"$error":"#VALUE!"},0,null,"",{"$error":"#VALUE!"},0,null,"",{"$error":"#VALUE!"},0,null,"",{"$error":"#VALUE!"},0]
[null,null,null,null,null,null,null,null,null,null,null,null,null,null,null,null,null,null,null,null,null,null,null,null,null,null,null,null,null,null,null,null,null,null,null,null,null,null,null,null,null,null,null,null,null,null,null,null,null,null,null,null,null,null,null,null,null,null,null,null,null,null,null,null,null,null,null,null,null,null,null,null,null,null,null,null,null,199,"",{"$error":"#VALUE!"},0,null,"",{"$error":"#VALUE!"},0,null,"",{"$error":"#VALUE!"},0,null,"",{"$error":"#VALUE!"},0,null,"",{"$error":"#VALUE!"},0]
[null,null,null,null,null,null,null,null,null,null,null,null,null,null,null,null,null,null,null,null,null,null,null,null,null,null,null,null,null,null,null,null,null,null,null,null,null,null,null,null,null,null,null,null,null,null,null,null,null,null,null,null,null,null,null,null,null,null,null,null,null,null,null,null,null,null,null,null,null,null,null,null,null,null,null,null,null,200,"",{"$error":"#VALUE!"},{"$error":"#VALUE!"},null,"",{"$error":"#VALUE!"},{"$error":"#VALUE!"},null,"",{"$error":"#VALUE!"},{"$error":"#VALUE!"},null,"",{"$error":"#VALUE!"},0,null,"",{"$error":"#VALUE!"},0]

{"sheet":"Verification","index":2,"n_rows":104,"n_cols":26,"rows_kept":104,"cut":false,"hidden":false,"merged":[]}
["Verification and Payment Worksheet",null,null,null,null,null,null,null,null,{"$f":"\"SPFPay Lot # \"&lotno&\", Contract \"&dist_ea","v":"SPFPay Lot # , Contract "}]
[" (Engineer Enters Verification Test Results on Rows 45 to 72)",null,null,null,null,null,null,"© 2020 California Department of Transportation",null,{"$f":"IF(contractorname=\"\",\"\",contractorname)","v":""}]
[null,null,null,null,null,"Pay Factor Quality Charachteristic (JMF Targets, Upper and Lower Spec Limits, and weighting factors)"]
[null,null,null,null,"Quality Characteristic","#8","#200","Binder Content","Field Compaction","Air Voids"]
[null,null,null,null,"Target Value",{"$f":"LotInfo!J27","v":0},{"$f":"LotInfo!O27","v":0},{"$f":"LotInfo!P27","v":0},{"$f":"LotInfo!Q27","v":0},{"$f":"LotInfo!R27","v":4}]
[null,null,null,null,"Production Tolerance",{"$f":"LotInfo!J29","v":5},{"$f":"LotInfo!O29","v":2},{"$f":"LotInfo!P29","v":0.4},{"$f":"LotInfo!Q29","v":0},{"$f":"LotInfo!R29","v":1.5}]
[null,null,null,null,"Upper Specification Limit",{"$f":"LotInfo!J30","v":""},{"$f":"LotInfo!O30","v":""},{"$f":"LotInfo!P30","v":""},{"$f":"LotInfo!Q30","v":96},{"$f":"LotInfo!R30","v":5.5}]
[null,null,null,null,"Lower Specification Limit",{"$f":"LotInfo!J31","v":""},{"$f":"LotInfo!O31","v":""},{"$f":"LotInfo!P31","v":""},{"$f":"LotInfo!Q31","v":92},{"$f":"LotInfo!R31","v":2.5}]
[null,null,null,null,"Weighting Factor   (w)",{"$f":"LotInfo!J32","v":0.05},{"$f":"LotInfo!O32","v":0.1},{"$f":"LotInfo!P32","v":0.25},{"$f":"LotInfo!Q32","v":0.4},{"$f":"LotInfo!R32","v":0.2}]
["Contractors QC Data from QCData Worksheet"]
[null,null,null,null,"Averages; QC & Verification",{"$f":"\"QC=\"&IFERROR(TEXT(ROUND(AVERAGE(F14:F40),1),\"0.0\"),\"\")&\", Verif=\"&IFERROR(TEXT(ROUND(AVERAGE(F45:F71),1),\"0.0\"),\"\")","v":"QC=, Verif="},{"$f":"\"QC=\"&IFERROR(TEXT(ROUND(AVERAGE(G14:G40),2),\"0.00\"),\"\")&\", Verif=\"&IFERROR(TEXT(ROUND(AVERAGE(G45:G71),2),\"0.00\"),\"\")","v":"QC=, Verif="},"QC=, Verif=","QC=, Verif=","QC=, Verif="]
[null,null,null,null,"Std Deviations;  QC & Verification",{"$f":"\"QC=\"&IFERROR(TEXT(ROUND(STDEV(F15:F41),1),\"0.0\"),\"\")&\", Verif=\"&IFERROR(TEXT(ROUND(STDEV(F46:F72),1),\"0.0\"),\"\")","v":"QC=, Verif="},{"$f":"\"QC=\"&IFERROR(TEXT(ROUND(STDEV(G15:G41),2),\"0.00\"),\"\")&\", Verif=\"&IFERROR(TEXT(ROUND(STDEV(G46:G72),2),\"0.00\"),\"\")","v":"QC=, Verif="},"QC=, Verif=","QC=, Verif=","QC=, Verif="]
["TEST NO.","Date","Tons of Material in sublot with waived density paid to use a QF=1.00","Lot No.","Sublot No.","#8","#200","Binder Content","Field Compaction","Air Voids"]
[{"$f":"IF((QCData!A30=\"\"),\"\",QCData!A30)","v":""},{"$f":"IF(QCData!B30=\"\",\"\",QCData!B30)","v":""},{"$f":"IF((QCData!C30=\"\"),\"\",QCData!C30)","v":""},{"$f":"IF((QCData!D30=\"\"),\"\",QCData!D30)","v":""},{"$f":"IF((QCData!E30=\"\"),\"\",QCData!E30)","v":""},{"$f":"IF((QCData!N30=\"\"),\"\",QCData!N30)","v":""},{"$f":"IF((QCData!S30=\"\"),\"\",QCData!S30)","v":""},{"$f":"IF((QCData!T30=\"\"),\"\",QCData!T30)","v":""},{"$f":"IF((QCData!AA30=\"\"),\"\",QCData!AA30)","v":""},{"$f":"IF((QCData!AB30=\"\"),\"\",QCData!AB30)","v":""}]
[{"$f":"IF((QCData!A31=\"\"),\"\",QCData!A31)","v":""},{"$f":"IF(QCData!B31=\"\",\"\",QCData!B31)","v":""},{"$f":"IF((QCData!C31=\"\"),\"\",QCData!C31)","v":""},{"$f":"IF((QCData!D31=\"\"),\"\",QCData!D31)","v":""},{"$f":"IF((QCData!E31=\"\"),\"\",QCData!E31)","v":""},{"$f":"IF((QCData!N31=\"\"),\"\",QCData!N31)","v":""},{"$f":"IF((QCData!S31=\"\"),\"\",QCData!S31)","v":""},{"$f":"IF((QCData!T31=\"\"),\"\",QCData!T31)","v":""},{"$f":"IF((QCData!AA31=\"\"),\"\",QCData!AA31)","v":""},{"$f":"IF((QCData!AB31=\"\"),\"\",QCData!AB31)","v":""}]
[{"$f":"IF((QCData!A32=\"\"),\"\",QCData!A32)","v":""},{"$f":"IF(QCData!B32=\"\",\"\",QCData!B32)","v":""},{"$f":"IF((QCData!C32=\"\"),\"\",QCData!C32)","v":""},{"$f":"IF((QCData!D32=\"\"),\"\",QCData!D32)","v":""},{"$f":"IF((QCData!E32=\"\"),\"\",QCData!E32)","v":""},{"$f":"IF((QCData!N32=\"\"),\"\",QCData!N32)","v":""},{"$f":"IF((QCData!S32=\"\"),\"\",QCData!S32)","v":""},{"$f":"IF((QCData!T32=\"\"),\"\",QCData!T32)","v":""},{"$f":"IF((QCData!AA32=\"\"),\"\",QCData!AA32)","v":""},{"$f":"IF((QCData!AB32=\"\"),\"\",QCData!AB32)","v":""}]
[{"$f":"IF((QCData!A33=\"\"),\"\",QCData!A33)","v":""},{"$f":"IF(QCData!B33=\"\",\"\",QCData!B33)","v":""},{"$f":"IF((QCData!C33=\"\"),\"\",QCData!C33)","v":""},{"$f":"IF((QCData!D33=\"\"),\"\",QCData!D33)","v":""},{"$f":"IF((QCData!E33=\"\"),\"\",QCData!E33)","v":""},{"$f":"IF((QCData!N33=\"\"),\"\",QCData!N33)","v":""},{"$f":"IF((QCData!S33=\"\"),\"\",QCData!S33)","v":""},{"$f":"IF((QCData!T33=\"\"),\"\",QCData!T33)","v":""},{"$f":"IF((QCData!AA33=\"\"),\"\",QCData!AA33)","v":""},{"$f":"IF((QCData!AB33=\"\"),\"\",QCData!AB33)","v":""}]
[{"$f":"IF((QCData!A34=\"\"),\"\",QCData!A34)","v":""},{"$f":"IF(QCData!B34=\"\",\"\",QCData!B34)","v":""},{"$f":"IF((QCData!C34=\"\"),\"\",QCData!C34)","v":""},{"$f":"IF((QCData!D34=\"\"),\"\",QCData!D34)","v":""},{"$f":"IF((QCData!E34=\"\"),\"\",QCData!E34)","v":""},{"$f":"IF((QCData!N34=\"\"),\"\",QCData!N34)","v":""},{"$f":"IF((QCData!S34=\"\"),\"\",QCData!S34)","v":""},{"$f":"IF((QCData!T34=\"\"),\"\",QCData!T34)","v":""},{"$f":"IF((QCData!AA34=\"\"),\"\",QCData!AA34)","v":""},{"$f":"IF((QCData!AB34=\"\"),\"\",QCData!AB34)","v":""}]
[{"$f":"IF((QCData!A35=\"\"),\"\",QCData!A35)","v":""},{"$f":"IF(QCData!B35=\"\",\"\",QCData!B35)","v":""},{"$f":"IF((QCData!C35=\"\"),\"\",QCData!C35)","v":""},{"$f":"IF((QCData!D35=\"\"),\"\",QCData!D35)","v":""},{"$f":"IF((QCData!E35=\"\"),\"\",QCData!E35)","v":""},{"$f":"IF((QCData!N35=\"\"),\"\",QCData!N35)","v":""},{"$f":"IF((QCData!S35=\"\"),\"\",QCData!S35)","v":""},{"$f":"IF((QCData!T35=\"\"),\"\",QCData!T35)","v":""},{"$f":"IF((QCData!AA35=\"\"),\"\",QCData!AA35)","v":""},{"$f":"IF((QCData!AB35=\"\"),\"\",QCData!AB35)","v":""}]
[{"$f":"IF((QCData!A36=\"\"),\"\",QCData!A36)","v":""},{"$f":"IF(QCData!B36=\"\",\"\",QCData!B36)","v":""},{"$f":"IF((QCData!C36=\"\"),\"\",QCData!C36)","v":""},{"$f":"IF((QCData!D36=\"\"),\"\",QCData!D36)","v":""},{"$f":"IF((QCData!E36=\"\"),\"\",QCData!E36)","v":""},{"$f":"IF((QCData!N36=\"\"),\"\",QCData!N36)","v":""},{"$f":"IF((QCData!S36=\"\"),\"\",QCData!S36)","v":""},{"$f":"IF((QCData!T36=\"\"),\"\",QCData!T36)","v":""},{"$f":"IF((QCData!AA36=\"\"),\"\",QCData!AA36)","v":""},{"$f":"IF((QCData!AB36=\"\"),\"\",QCData!AB36)","v":""}]
[{"$f":"IF((QCData!A37=\"\"),\"\",QCData!A37)","v":""},{"$f":"IF(QCData!B37=\"\",\"\",QCData!B37)","v":""},{"$f":"IF((QCData!C37=\"\"),\"\",QCData!C37)","v":""},{"$f":"IF((QCData!D37=\"\"),\"\",QCData!D37)","v":""},{"$f":"IF((QCData!E37=\"\"),\"\",QCData!E37)","v":""},{"$f":"IF((QCData!N37=\"\"),\"\",QCData!N37)","v":""},{"$f":"IF((QCData!S37=\"\"),\"\",QCData!S37)","v":""},{"$f":"IF((QCData!T37=\"\"),\"\",QCData!T37)","v":""},{"$f":"IF((QCData!AA37=\"\"),\"\",QCData!AA37)","v":""},{"$f":"IF((QCData!AB37=\"\"),\"\",QCData!AB37)","v":""}]
[{"$f":"IF((QCData!A38=\"\"),\"\",QCData!A38)","v":""},{"$f":"IF(QCData!B38=\"\",\"\",QCData!B38)","v":""},{"$f":"IF((QCData!C38=\"\"),\"\",QCData!C38)","v":""},{"$f":"IF((QCData!D38=\"\"),\"\",QCData!D38)","v":""},{"$f":"IF((QCData!E38=\"\"),\"\",QCData!E38)","v":""},{"$f":"IF((QCData!N38=\"\"),\"\",QCData!N38)","v":""},{"$f":"IF((QCData!S38=\"\"),\"\",QCData!S38)","v":""},{"$f":"IF((QCData!T38=\"\"),\"\",QCData!T38)","v":""},{"$f":"IF((QCData!AA38=\"\"),\"\",QCData!AA38)","v":""},{"$f":"IF((QCData!AB38=\"\"),\"\",QCData!AB38)","v":""}]
[{"$f":"IF((QCData!A39=\"\"),\"\",QCData!A39)","v":""},{"$f":"IF(QCData!B39=\"\",\"\",QCData!B39)","v":""},{"$f":"IF((QCData!C39=\"\"),\"\",QCData!C39)","v":""},{"$f":"IF((QCData!D39=\"\"),\"\",QCData!D39)","v":""},{"$f":"IF((QCData!E39=\"\"),\"\",QCData!E39)","v":""},{"$f":"IF((QCData!N39=\"\"),\"\",QCData!N39)","v":""},{"$f":"IF((QCData!S39=\"\"),\"\",QCData!S39)","v":""},{"$f":"IF((QCData!T39=\"\"),\"\",QCData!T39)","v":""},{"$f":"IF((QCData!AA39=\"\"),\"\",QCData!AA39)","v":""},{"$f":"IF((QCData!AB39=\"\"),\"\",QCData!AB39)","v":""}]
[{"$f":"IF((QCData!A40=\"\"),\"\",QCData!A40)","v":""},{"$f":"IF(QCData!B40=\"\",\"\",QCData!B40)","v":""},{"$f":"IF((QCData!C40=\"\"),\"\",QCData!C40)","v":""},{"$f":"IF((QCData!D40=\"\"),\"\",QCData!D40)","v":""},{"$f":"IF((QCData!E40=\"\"),\"\",QCData!E40)","v":""},{"$f":"IF((QCData!N40=\"\"),\"\",QCData!N40)","v":""},{"$f":"IF((QCData!S40=\"\"),\"\",QCData!S40)","v":""},{"$f":"IF((QCData!T40=\"\"),\"\",QCData!T40)","v":""},{"$f":"IF((QCData!AA40=\"\"),\"\",QCData!AA40)","v":""},{"$f":"IF((QCData!AB40=\"\"),\"\",QCData!AB40)","v":""}]
[{"$f":"IF((QCData!A41=\"\"),\"\",QCData!A41)","v":""},{"$f":"IF(QCData!B41=\"\",\"\",QCData!B41)","v":""},{"$f":"IF((QCData!C41=\"\"),\"\",QCData!C41)","v":""},{"$f":"IF((QCData!D41=\"\"),\"\",QCData!D41)","v":""},{"$f":"IF((QCData!E41=\"\"),\"\",QCData!E41)","v":""},{"$f":"IF((QCData!N41=\"\"),\"\",QCData!N41)","v":""},{"$f":"IF((QCData!S41=\"\"),\"\",QCData!S41)","v":""},{"$f":"IF((QCData!T41=\"\"),\"\",QCData!T41)","v":""},{"$f":"IF((QCData!AA41=\"\"),\"\",QCData!AA41)","v":""},{"$f":"IF((QCData!AB41=\"\"),\"\",QCData!AB41)","v":""}]
[{"$f":"IF((QCData!A42=\"\"),\"\",QCData!A42)","v":""},{"$f":"IF(QCData!B42=\"\",\"\",QCData!B42)","v":""},{"$f":"IF((QCData!C42=\"\"),\"\",QCData!C42)","v":""},{"$f":"IF((QCData!D42=\"\"),\"\",QCData!D42)","v":""},{"$f":"IF((QCData!E42=\"\"),\"\",QCData!E42)","v":""},{"$f":"IF((QCData!N42=\"\"),\"\",QCData!N42)","v":""},{"$f":"IF((QCData!S42=\"\"),\"\",QCData!S42)","v":""},{"$f":"IF((QCData!T42=\"\"),\"\",QCData!T42)","v":""},{"$f":"IF((QCData!AA42=\"\"),\"\",QCData!AA42)","v":""},{"$f":"IF((QCData!AB42=\"\"),\"\",QCData!AB42)","v":""}]
[{"$f":"IF((QCData!A43=\"\"),\"\",QCData!A43)","v":""},{"$f":"IF(QCData!B43=\"\",\"\",QCData!B43)","v":""},{"$f":"IF((QCData!C43=\"\"),\"\",QCData!C43)","v":""},{"$f":"IF((QCData!D43=\"\"),\"\",QCData!D43)","v":""},{"$f":"IF((QCData!E43=\"\"),\"\",QCData!E43)","v":""},{"$f":"IF((QCData!N43=\"\"),\"\",QCData!N43)","v":""},{"$f":"IF((QCData!S43=\"\"),\"\",QCData!S43)","v":""},{"$f":"IF((QCData!T43=\"\"),\"\",QCData!T43)","v":""},{"$f":"IF((QCData!AA43=\"\"),\"\",QCData!AA43)","v":""},{"$f":"IF((QCData!AB43=\"\"),\"\",QCData!AB43)","v":""}]
[{"$f":"IF((QCData!A44=\"\"),\"\",QCData!A44)","v":""},{"$f":"IF(QCData!B44=\"\",\"\",QCData!B44)","v":""},{"$f":"IF((QCData!C44=\"\"),\"\",QCData!C44)","v":""},{"$f":"IF((QCData!D44=\"\"),\"\",QCData!D44)","v":""},{"$f":"IF((QCData!E44=\"\"),\"\",QCData!E44)","v":""},{"$f":"IF((QCData!N44=\"\"),\"\",QCData!N44)","v":""},{"$f":"IF((QCData!S44=\"\"),\"\",QCData!S44)","v":""},{"$f":"IF((QCData!T44=\"\"),\"\",QCData!T44)","v":""},{"$f":"IF((QCData!AA44=\"\"),\"\",QCData!AA44)","v":""},{"$f":"IF((QCData!AB44=\"\"),\"\",QCData!AB44)","v":""}]
[{"$f":"IF((QCData!A45=\"\"),\"\",QCData!A45)","v":""},{"$f":"IF(QCData!B45=\"\",\"\",QCData!B45)","v":""},{"$f":"IF((QCData!C45=\"\"),\"\",QCData!C45)","v":""},{"$f":"IF((QCData!D45=\"\"),\"\",QCData!D45)","v":""},{"$f":"IF((QCData!E45=\"\"),\"\",QCData!E45)","v":""},{"$f":"IF((QCData!N45=\"\"),\"\",QCData!N45)","v":""},{"$f":"IF((QCData!S45=\"\"),\"\",QCData!S45)","v":""},{"$f":"IF((QCData!T45=\"\"),\"\",QCData!T45)","v":""},{"$f":"IF((QCData!AA45=\"\"),\"\",QCData!AA45)","v":""},{"$f":"IF((QCData!AB45=\"\"),\"\",QCData!AB45)","v":""}]
[{"$f":"IF((QCData!A46=\"\"),\"\",QCData!A46)","v":""},{"$f":"IF(QCData!B46=\"\",\"\",QCData!B46)","v":""},{"$f":"IF((QCData!C46=\"\"),\"\",QCData!C46)","v":""},{"$f":"IF((QCData!D46=\"\"),\"\",QCData!D46)","v":""},{"$f":"IF((QCData!E46=\"\"),\"\",QCData!E46)","v":""},{"$f":"IF((QCData!N46=\"\"),\"\",QCData!N46)","v":""},{"$f":"IF((QCData!S46=\"\"),\"\",QCData!S46)","v":""},{"$f":"IF((QCData!T46=\"\"),\"\",QCData!T46)","v":""},{"$f":"IF((QCData!AA46=\"\"),\"\",QCData!AA46)","v":""},{"$f":"IF((QCData!AB46=\"\"),\"\",QCData!AB46)","v":""},{"$f":"IF(DK30=\"\",\"\",DK30)","v":""},"","","","","","","","","","","","","","",""]
[{"$f":"IF((QCData!A47=\"\"),\"\",QCData!A47)","v":""},{"$f":"IF(QCData!B47=\"\",\"\",QCData!B47)","v":""},{"$f":"IF((QCData!C47=\"\"),\"\",QCData!C47)","v":""},{"$f":"IF((QCData!D47=\"\"),\"\",QCData!D47)","v":""},{"$f":"IF((QCData!E47=\"\"),\"\",QCData!E47)","v":""},{"$f":"IF((QCData!N47=\"\"),\"\",QCData!N47)","v":""},{"$f":"IF((QCData!S47=\"\"),\"\",QCData!S47)","v":""},{"$f":"IF((QCData!T47=\"\"),\"\",QCData!T47)","v":""},{"$f":"IF((QCData!AA47=\"\"),\"\",QCData!AA47)","v":""},{"$f":"IF((QCData!AB47=\"\"),\"\",QCData!AB47)","v":""},{"$f":"IF(DK31=\"\",\"\",DK31)","v":""},{"$f":"IF(DL31=\"\",\"\",DL31)","v":""},{"$f":"IF(DM31=\"\",\"\",DM31)","v":""},{"$f":"IF(DN31=\"\",\"\",DN31)","v":""},{"$f":"IF(DO31=\"\",\"\",DO31)","v":""},{"$f":"IF(DP31=\"\",\"\",DP31)","v":""},{"$f":"IF(DQ31=\"\",\"\",DQ31)","v":""},{"$f":"IF(DR31=\"\",\"\",DR31)","v":""},{"$f":"IF(DS31=\"\",\"\",DS31)","v":""},{"$f":"IF(DT31=\"\",\"\",DT31)","v":""},{"$f":"IF(DU31=\"\",\"\",DU31)","v":""},{"$f":"IF(DV31=\"\",\"\",DV31)","v":""},{"$f":"IF(DW31=\"\",\"\",DW31)","v":""},{"$f":"IF(DX31=\"\",\"\",DX31)","v":""},{"$f":"IF(DY31=\"\",\"\",DY31)","v":""},{"$f":"IF(DZ31=\"\",\"\",DZ31)","v":""}]
[{"$f":"IF((QCData!A48=\"\"),\"\",QCData!A48)","v":""},{"$f":"IF(QCData!B48=\"\",\"\",QCData!B48)","v":""},{"$f":"IF((QCData!C48=\"\"),\"\",QCData!C48)","v":""},{"$f":"IF((QCData!D48=\"\"),\"\",QCData!D48)","v":""},{"$f":"IF((QCData!E48=\"\"),\"\",QCData!E48)","v":""},{"$f":"IF((QCData!N48=\"\"),\"\",QCData!N48)","v":""},{"$f":"IF((QCData!S48=\"\"),\"\",QCData!S48)","v":""},{"$f":"IF((QCData!T48=\"\"),\"\",QCData!T48)","v":""},{"$f":"IF((QCData!AA48=\"\"),\"\",QCData!AA48)","v":""},{"$f":"IF((QCData!AB48=\"\"),\"\",QCData!AB48)","v":""},"","","","","","","","","","","","","","","",""]
[{"$f":"IF((QCData!A49=\"\"),\"\",QCData!A49)","v":""},{"$f":"IF(QCData!B49=\"\",\"\",QCData!B49)","v":""},{"$f":"IF((QCData!C49=\"\"),\"\",QCData!C49)","v":""},{"$f":"IF((QCData!D49=\"\"),\"\",QCData!D49)","v":""},{"$f":"IF((QCData!E49=\"\"),\"\",QCData!E49)","v":""},{"$f":"IF((QCData!N49=\"\"),\"\",QCData!N49)","v":""},{"$f":"IF((QCData!S49=\"\"),\"\",QCData!S49)","v":""},{"$f":"IF((QCData!T49=\"\"),\"\",QCData!T49)","v":""},{"$f":"IF((QCData!AA49=\"\"),\"\",QCData!AA49)","v":""},{"$f":"IF((QCData!AB49=\"\"),\"\",QCData!AB49)","v":""},"","","","","","","","","","","","","","","",""]
[{"$f":"IF((QCData!A50=\"\"),\"\",QCData!A50)","v":""},{"$f":"IF(QCData!B50=\"\",\"\",QCData!B50)","v":""},{"$f":"IF((QCData!C50=\"\"),\"\",QCData!C50)","v":""},{"$f":"IF((QCData!D50=\"\"),\"\",QCData!D50)","v":""},{"$f":"IF((QCData!E50=\"\"),\"\",QCData!E50)","v":""},{"$f":"IF((QCData!N50=\"\"),\"\",QCData!N50)","v":""},{"$f":"IF((QCData!S50=\"\"),\"\",QCData!S50)","v":""},{"$f":"IF((QCData!T50=\"\"),\"\",QCData!T50)","v":""},{"$f":"IF((QCData!AA50=\"\"),\"\",QCData!AA50)","v":""},{"$f":"IF((QCData!AB50=\"\"),\"\",QCData!AB50)","v":""},"","","","","","","","","","","","","","","",""]
[{"$f":"IF((QCData!A51=\"\"),\"\",QCData!A51)","v":""},{"$f":"IF(QCData!B51=\"\",\"\",QCData!B51)","v":""},{"$f":"IF((QCData!C51=\"\"),\"\",QCData!C51)","v":""},{"$f":"IF((QCData!D51=\"\"),\"\",QCData!D51)","v":""},{"$f":"IF((QCData!E51=\"\"),\"\",QCData!E51)","v":""},{"$f":"IF((QCData!N51=\"\"),\"\",QCData!N51)","v":""},{"$f":"IF((QCData!S51=\"\"),\"\",QCData!S51)","v":""},{"$f":"IF((QCData!T51=\"\"),\"\",QCData!T51)","v":""},{"$f":"IF((QCData!AA51=\"\"),\"\",QCData!AA51)","v":""},{"$f":"IF((QCData!AB51=\"\"),\"\",QCData!AB51)","v":""},"","","","","","","","","","","","","","","",""]
[{"$f":"IF((QCData!A52=\"\"),\"\",QCData!A52)","v":""},{"$f":"IF(QCData!B52=\"\",\"\",QCData!B52)","v":""},{"$f":"IF((QCData!C52=\"\"),\"\",QCData!C52)","v":""},{"$f":"IF((QCData!D52=\"\"),\"\",QCData!D52)","v":""},{"$f":"IF((QCData!E52=\"\"),\"\",QCData!E52)","v":""},{"$f":"IF((QCData!N52=\"\"),\"\",QCData!N52)","v":""},{"$f":"IF((QCData!S52=\"\"),\"\",QCData!S52)","v":""},{"$f":"IF((QCData!T52=\"\"),\"\",QCData!T52)","v":""},{"$f":"IF((QCData!AA52=\"\"),\"\",QCData!AA52)","v":""},{"$f":"IF((QCData!AB52=\"\"),\"\",QCData!AB52)","v":""},"","","","","","","","","","","","","","","",""]
[{"$f":"IF((QCData!A53=\"\"),\"\",QCData!A53)","v":""},{"$f":"IF(QCData!B53=\"\",\"\",QCData!B53)","v":""},{"$f":"IF((QCData!C53=\"\"),\"\",QCData!C53)","v":""},{"$f":"IF((QCData!D53=\"\"),\"\",QCData!D53)","v":""},{"$f":"IF((QCData!E53=\"\"),\"\",QCData!E53)","v":""},{"$f":"IF((QCData!N53=\"\"),\"\",QCData!N53)","v":""},{"$f":"IF((QCData!S53=\"\"),\"\",QCData!S53)","v":""},{"$f":"IF((QCData!T53=\"\"),\"\",QCData!T53)","v":""},{"$f":"IF((QCData!AA53=\"\"),\"\",QCData!AA53)","v":""},{"$f":"IF((QCData!AB53=\"\"),\"\",QCData!AB53)","v":""},"","","","","","","","","","","","","","","",""]
[{"$f":"IF((QCData!A54=\"\"),\"\",QCData!A54)","v":""},{"$f":"IF(QCData!B54=\"\",\"\",QCData!B54)","v":""},{"$f":"IF((QCData!C54=\"\"),\"\",QCData!C54)","v":""},{"$f":"IF((QCData!D54=\"\"),\"\",QCData!D54)","v":""},{"$f":"IF((QCData!E54=\"\"),\"\",QCData!E54)","v":""},{"$f":"IF((QCData!N54=\"\"),\"\",QCData!N54)","v":""},{"$f":"IF((QCData!S54=\"\"),\"\",QCData!S54)","v":""},{"$f":"IF((QCData!T54=\"\"),\"\",QCData!T54)","v":""},{"$f":"IF((QCData!AA54=\"\"),\"\",QCData!AA54)","v":""},{"$f":"IF((QCData!AB54=\"\"),\"\",QCData!AB54)","v":""},"","","","","","","","","","","","","","","",""]
[{"$f":"IF((QCData!A55=\"\"),\"\",QCData!A55)","v":""},{"$f":"IF(QCData!B55=\"\",\"\",QCData!B55)","v":""},{"$f":"IF((QCData!C55=\"\"),\"\",QCData!C55)","v":""},{"$f":"IF((QCData!D55=\"\"),\"\",QCData!D55)","v":""},{"$f":"IF((QCData!E55=\"\"),\"\",QCData!E55)","v":""},{"$f":"IF((QCData!N55=\"\"),\"\",QCData!N55)","v":""},{"$f":"IF((QCData!S55=\"\"),\"\",QCData!S55)","v":""},{"$f":"IF((QCData!T55=\"\"),\"\",QCData!T55)","v":""},{"$f":"IF((QCData!AA55=\"\"),\"\",QCData!AA55)","v":""},{"$f":"IF((QCData!AB55=\"\"),\"\",QCData!AB55)","v":""},"","","","","","","","","","","","","","","",""]
[{"$f":"IF((QCData!A56=\"\"),\"\",QCData!A56)","v":""},{"$f":"IF(QCData!B56=\"\",\"\",QCData!B56)","v":""},{"$f":"IF((QCData!C56=\"\"),\"\",QCData!C56)","v":""},{"$f":"IF((QCData!D56=\"\"),\"\",QCData!D56)","v":""},{"$f":"IF((QCData!E56=\"\"),\"\",QCData!E56)","v":""},{"$f":"IF((QCData!N56=\"\"),\"\",QCData!N56)","v":""},{"$f":"IF((QCData!S56=\"\"),\"\",QCData!S56)","v":""},{"$f":"IF((QCData!T56=\"\"),\"\",QCData!T56)","v":""},{"$f":"IF((QCData!AA56=\"\"),\"\",QCData!AA56)","v":""},{"$f":"IF((QCData!AB56=\"\"),\"\",QCData!AB56)","v":""},"","","","","","","","","","","","","","","",""]
[null,null,{"$f":"\"Total Waived Density Tons= \"&SUM(C14:C40)","v":"Total Waived Density Tons= 0"},null,null,null,null,null,null,null,"","","","","","","","","","","","","","","",""]
[null,null,"Note: PWL values calculated per the SPF specifications are based on FHWA provided formulas using a Beta Distribution.  The normal distribution curves above are provided for information only.",null,null,null,null,null,null,null,"","","","","","","","","","","","","","","",""]
["Engineers Pay Factor Verification Data (Using Random Sampling Plan, enter Verification Test Data on row with corresponding contractor sublot).",null,null,null,null,null,null,null,null,null,"","","","","","","","","","","","","","","",""]
["TEST NO.","Date","Engineers Determination of Tons of Material in sublot with waived density paid to use a QF=1.00","Lot No.","Sample from within Contractor Sublot No.","#8","#200","Binder Content","Field Compaction","Air Voids","","","","","","","","","","","","","","","",""]
[null,null,null,{"$f":"D14","v":""},{"$f":"E14","v":""},null,null,null,null,null,"","","","","","","","","","","","","","","",""]
[null,null,null,{"$f":"D15","v":""},"",null,null,null,null,null,"","","","","","","","","","","","","","","",""]
[null,null,null,{"$f":"D16","v":""},"",null,null,null,null,null,"","","","","","","","","","","","","","","",""]
[null,null,null,{"$f":"D17","v":""},"",null,null,null,null,null,"","","","","","","","","","","","","","","",""]
[null,null,null,{"$f":"D18","v":""},"",null,null,null,null,null,"","","","","","","","","","","","","","","",""]
[null,null,null,{"$f":"D19","v":""},"",null,null,null,null,null,"","","","","","","","","","","","","","","",""]
[null,null,null,{"$f":"D20","v":""},"",null,null,null,null,null,"","","","","","","","","","","","","","","",""]
[null,null,null,{"$f":"D21","v":""},"",null,null,null,null,null,"","","","","","","","","","","","","","","",""]
[null,null,null,{"$f":"D22","v":""},"",null,null,null,null,null,"","","","","","","","","","","","","","","",""]
[null,null,null,{"$f":"D23","v":""},"",null,null,null,null,null,"","","","","","","","","","","","","","","",""]
[null,null,null,{"$f":"D24","v":""},"",null,null,null,null,null,"","","","","","","","","","","","","","","",""]
[null,null,null,{"$f":"D25","v":""},"",null,null,null,null,null,"","","","","","","","","","","","","","","",""]
[null,null,null,{"$f":"D26","v":""},""]
[null,null,null,{"$f":"D27","v":""},""]
[null,null,null,{"$f":"D28","v":""},""]
[null,null,null,{"$f":"D29","v":""},""]
[null,null,null,{"$f":"D30","v":""},""]
[null,null,null,{"$f":"D31","v":""},""]
[null,null,null,{"$f":"D32","v":""},""]
[null,null,null,{"$f":"D33","v":""},""]
[null,null,null,{"$f":"D34","v":""},""]
[null,null,null,{"$f":"D35","v":""},""]
[null,null,null,{"$f":"D36","v":""},""]
[null,null,null,{"$f":"D37","v":""},""]
[null,null,null,{"$f":"D38","v":""},""]
[null,null,null,{"$f":"D39","v":""},""]
[null,null,null,{"$f":"D40","v":""},""]
[]
[]
["Verification Report"]
[null,null,null,null,"Quality Characteristic","#8","#200","Binder Content","Field Compaction","Air Voids"]
[null,null,"Sp",null,null,{"$f":"SQRT(( (  (STDEV(F14:F40)^2*(COUNT(F14:F40)-1))  + (STDEV(F45:F71)^2*(COUNT(F45:F71)-1)) ) / (COUNT(F14:F40)+COUNT(F45:F71)-2) ))","v":{"$error":"#DIV/0!"}},{"$f":"SQRT(( (  (STDEV(G14:G40)^2*(COUNT(G14:G40)-1))  + (STDEV(G45:G71)^2*(COUNT(G45:G71)-1)) ) / (COUNT(G14:G40)+COUNT(G45:G71)-2) ))","v":{"$error":"#DIV/0!"}},{"$f":"SQRT(( (  (STDEV(H14:H40)^2*(COUNT(H14:H40)-1))  + (STDEV(H45:H71)^2*(COUNT(H45:H71)-1)) ) / (COUNT(H14:H40)+COUNT(H45:H71)-2) ))","v":{"$error":"#DIV/0!"}},{"$error":"#DIV/0!"},{"$error":"#DIV/0!"}]
[null,null,"F value",null,null,{"$f":"IF(AND(ISNUMBER(STDEV(F14:F40)),(ISNUMBER(STDEV(F45:F71)))),STDEV(F45:F71)^2/STDEV(F14:F40)^2,\"\")","v":""},{"$f":"IF(AND(ISNUMBER(STDEV(G14:G40)),(ISNUMBER(STDEV(G45:G71)))),STDEV(G45:G71)^2/STDEV(G14:G40)^2,\"\")","v":""},{"$f":"IF(AND(ISNUMBER(STDEV(H14:H40)),(ISNUMBER(STDEV(H45:H71)))),STDEV(H45:H71)^2/STDEV(H14:H40)^2,\"\")","v":""},"",""]
[null,null,"numerator (nv-1) for Fcrit Lookup",null,null,{"$f":"IF(ISNUMBER(   COUNT(F45:F71)   ), COUNT(F45:F71)-1,\"\")","v":-1},{"$f":"IF(ISNUMBER(   COUNT(G45:G71)   ), COUNT(G45:G71)-1,\"\")","v":-1},{"$f":"IF(ISNUMBER(   COUNT(H45:H71)   ), COUNT(H45:H71)-1,\"\")","v":-1},-1,-1]
[null,null,"denominator (nc-1) for Fcrit Lookup",null,null,{"$f":"IF(ISNUMBER(COUNT(F14:F40)), COUNT(F14:F40)-1,\"\")","v":-1},{"$f":"IF(ISNUMBER(COUNT(G14:G40)), COUNT(G14:G40)-1,\"\")","v":-1},{"$f":"IF(ISNUMBER(COUNT(H14:H40)), COUNT(H14:H40)-1,\"\")","v":-1},-1,-1]
[null,null,"F crit from table F Table",null,null,{"$f":"IF((AND(ISNUMBER(F78),ISNUMBER(F79))),VLOOKUP(F78,'F Table'!$C6:$AG27,Verification!F79+1,FALSE),\"\")","v":{"$error":"#N/A"}},{"$f":"IF((AND(ISNUMBER(G78),ISNUMBER(G79))),VLOOKUP(G78,'F Table'!$C6:$AG27,Verification!G79+1,FALSE),\"\")","v":{"$error":"#N/A"}},{"$f":"IF((AND(ISNUMBER(H78),ISNUMBER(H79))),VLOOKUP(H78,'F Table'!$C6:$AG27,Verification!H79+1,FALSE),\"\")","v":{"$error":"#N/A"}},{"$f":"IF((AND(ISNUMBER(I78),ISNUMBER(I79))),VLOOKUP(I78,'F Table'!$C6:$AG27,Verification!I79+1,FALSE),\"\")","v":{"$error":"#N/A"}},{"$f":"IF((AND(ISNUMBER(J78),ISNUMBER(J79))),VLOOKUP(J78,'F Table'!$C6:$AG27,Verification!J79+1,FALSE),\"\")","v":{"$error":"#N/A"}}]
[null,null,"If F<Fcrit then \"variances assumed equal\"",null,null,{"$f":"IF(ISNUMBER(F80),(IF(F77<=F80,\"variances equal\",\"variances unequal\")),\"\")","v":""},{"$f":"IF(ISNUMBER(G80),(IF(G77<=G80,\"variances equal\",\"variances unequal\")),\"\")","v":""},{"$f":"IF(ISNUMBER(H80),(IF(H77<=H80,\"variances equal\",\"variances unequal\")),\"\")","v":""},{"$f":"IF(ISNUMBER(I80),(IF(I77<=I80,\"variances equal\",\"variances unequal\")),\"\")","v":""},{"$f":"IF(ISNUMBER(J80),(IF(J77<=J80,\"variances equal\",\"variances unequal\")),\"\")","v":""}]
[null,null,"\"t stat.\"",null,null,{"$f":"ROUND((IF(F81=\"variances equal\", (ABS(   AVERAGE(F14:F40) - AVERAGE(F45:F71)   ))/ (F76 * SQRT(1/COUNT(F14:F40) + 1/COUNT(F45:F71))),(ABS(AVERAGE(F14:F40)-AVERAGE(F45:F71)))/SQRT((STDEV(F14:F40)^2/COUNT(F14:F40))+(STDEV(F45:F71)^2/COUNT(F45:F71))))),3)","v":{"$error":"#DIV/0!"}},{"$f":"ROUND((IF(G81=\"variances equal\", (ABS(   AVERAGE(G14:G40) - AVERAGE(G45:G71)   ))/ (G76 * SQRT(1/COUNT(G14:G40) + 1/COUNT(G45:G71))),(ABS(AVERAGE(G14:G40)-AVERAGE(G45:G71)))/SQRT((STDEV(G14:G40)^2/COUNT(G14:G40))+(STDEV(G45:G71)^2/COUNT(G45:G71))))),3)","v":{"$error":"#DIV/0!"}},{"$f":"ROUND((IF(H81=\"variances equal\", (ABS(   AVERAGE(H14:H40) - AVERAGE(H45:H71)   ))/ (H76 * SQRT(1/COUNT(H14:H40) + 1/COUNT(H45:H71))),(ABS(AVERAGE(H14:H40)-AVERAGE(H45:H71)))/SQRT((STDEV(H14:H40)^2/COUNT(H14:H40))+(STDEV(H45:H71)^2/COUNT(H45:H71))))),3)","v":{"$error":"#DIV/0!"}},{"$f":"ROUND((IF(I81=\"variances equal\", (ABS(   AVERAGE(I14:I40) - AVERAGE(I45:I71)   ))/ (I76 * SQRT(1/COUNT(I14:I40) + 1/COUNT(I45:I71))),(ABS(AVERAGE(I14:I40)-AVERAGE(I45:I71)))/SQRT((STDEV(I14:I40)^2/COUNT(I14:I40))+(STDEV(I45:I71)^2/COUNT(I45:I71))))),3)","v":{"$error":"#DIV/0!"}},{"$f":"ROUND((IF(J81=\"variances equal\", (ABS(   AVERAGE(J14:J40) - AVERAGE(J45:J71)   ))/ (J76 * SQRT(1/COUNT(J14:J40) + 1/COUNT(J45:J71))),(ABS(AVERAGE(J14:J40)-AVERAGE(J45:J71)))/SQRT((STDEV(J14:J40)^2/COUNT(J14:J40))+(STDEV(J45:J71)^2/COUNT(J45:J71))))),3)","v":{"$error":"#DIV/0!"}}]
[null,null,"effective degrees of freedom (f')",null,null,{"$f":"ROUNDDOWN(((((STDEV(F14:F40)^2/COUNT(F14:F40))+(STDEV(F45:F71)^2/COUNT(F45:F71)))^2)/((((STDEV(F14:F40)^2/COUNT(F14:F40))^2)/(COUNT(F14:F40)+1))+((((STDEV(F45:F71)^2)/COUNT(F45:F71))^2)/(COUNT(F45:F71)+1))))-2,0)","v":{"$error":"#DIV/0!"}},{"$f":"ROUNDDOWN(((((STDEV(G14:G40)^2/COUNT(G14:G40))+(STDEV(G45:G71)^2/COUNT(G45:G71)))^2)/((((STDEV(G14:G40)^2/COUNT(G14:G40))^2)/(COUNT(G14:G40)+1))+((((STDEV(G45:G71)^2)/COUNT(G45:G71))^2)/(COUNT(G45:G71)+1))))-2,0)","v":{"$error":"#DIV/0!"}},{"$f":"ROUNDDOWN(((((STDEV(H14:H40)^2/COUNT(H14:H40))+(STDEV(H45:H71)^2/COUNT(H45:H71)))^2)/((((STDEV(H14:H40)^2/COUNT(H14:H40))^2)/(COUNT(H14:H40)+1))+((((STDEV(H45:H71)^2)/COUNT(H45:H71))^2)/(COUNT(H45:H71)+1))))-2,0)","v":{"$error":"#DIV/0!"}},{"$error":"#DIV/0!"},{"$error":"#DIV/0!"}]
[null,null,"t crit. (variances equal; nc+nv-2)",null,null,{"$f":"LOOKUP((COUNT(F14:F40)+COUNT(F45:F71)-2),degreefreedom,tcrit)","v":{"$error":"#N/A"}},{"$f":"LOOKUP((COUNT(G14:G40)+COUNT(G45:G71)-2),degreefreedom,tcrit)","v":{"$error":"#N/A"}},{"$f":"LOOKUP((COUNT(H14:H40)+COUNT(H45:H71)-2),degreefreedom,tcrit)","v":{"$error":"#N/A"}},{"$f":"LOOKUP((COUNT(I14:I40)+COUNT(I45:I71)-2),degreefreedom,tcrit)","v":{"$error":"#N/A"}},{"$f":"LOOKUP((COUNT(J14:J40)+COUNT(J45:J71)-2),degreefreedom,tcrit)","v":{"$error":"#N/A"}}]
[null,null,"t crit.  (variances not equal; f')",null,null,{"$f":"LOOKUP(F83,degreefreedom,tcrit)","v":{"$error":"#DIV/0!"}},{"$f":"LOOKUP(G83,degreefreedom,tcrit)","v":{"$error":"#DIV/0!"}},{"$f":"LOOKUP(H83,degreefreedom,tcrit)","v":{"$error":"#DIV/0!"}},{"$f":"LOOKUP(I83,degreefreedom,tcrit)","v":{"$error":"#DIV/0!"}},{"$f":"LOOKUP(J83,degreefreedom,tcrit)","v":{"$error":"#DIV/0!"}}]
[null,null,"t crit",null,null,{"$f":"IF(F81=\"variances equal\",F84,F85)","v":{"$error":"#DIV/0!"}},{"$f":"IF(G81=\"variances equal\",G84,G85)","v":{"$error":"#DIV/0!"}},{"$f":"IF(H81=\"variances equal\",H84,H85)","v":{"$error":"#DIV/0!"}},{"$error":"#DIV/0!"},{"$error":"#DIV/0!"}]
[null,null,"Check if enough data",null,null,{"$f":"(IF(AND(COUNT(F14:F40)<19.5,COUNT(F45:F71)>=3),\"YES\",IF(AND(COUNT(F14:F40)>19.5,COUNT(F14:F40)<24.5,COUNT(F45:F71)>=4),\"YES\",IF(AND(COUNT(F14:F40)>24.5,COUNT(F45:F71)>=5),\"YES\",\"NO\"))))","v":"NO"},{"$f":"(IF(AND(COUNT(G14:G40)<19.5,COUNT(G45:G71)>=3),\"YES\",IF(AND(COUNT(G14:G40)>19.5,COUNT(G14:G40)<24.5,COUNT(G45:G71)>=4),\"YES\",IF(AND(COUNT(G14:G40)>24.5,COUNT(G45:G71)>=5),\"YES\",\"NO\"))))","v":"NO"},{"$f":"(IF(AND(COUNT(H14:H40)<19.5,COUNT(H45:H71)>=3),\"YES\",IF(AND(COUNT(H14:H40)>19.5,COUNT(H14:H40)<24.5,COUNT(H45:H71)>=4),\"YES\",IF(AND(COUNT(H14:H40)>24.5,COUNT(H45:H71)>=5),\"YES\",\"NO\"))))","v":"NO"},"NO","NO"]
[null,null,"Is t<tcrit (Verification Pass) ",null,null,{"$f":"IF(F87=\"YES\",IF(F82<=F86,\"PASS\",\"FAIL\"),IF(N105=\"NO\",\"INS.DATA\",\"\"))","v":""},{"$f":"IF(G87=\"YES\",IF(G82<=G86,\"PASS\",\"FAIL\"),IF(O105=\"NO\",\"INS.DATA\",\"\"))","v":""},{"$f":"IF(H87=\"YES\",IF(H82<=H86,\"PASS\",\"FAIL\"),IF(P105=\"NO\",\"INS.DATA\",\"\"))","v":""},{"$f":"IF(I87=\"YES\",IF(I82<=I86,\"PASS\",\"FAIL\"),IF(Q105=\"NO\",\"INS.DATA\",\"\"))","v":""},{"$f":"IF(J87=\"YES\",IF(J82<=J86,\"PASS\",\"FAIL\"),IF(R105=\"NO\",\"INS.DATA\",\"\"))","v":""}]
[null,null,"2nd check, is IXc-XvI < All.Diff.",null,null,{"$f":"IF(F88=\"INS.DATA\",\"INS.DATA\", IF(F88=\"FAIL\", IF(ABS(AVERAGE(F14:F40)-AVERAGE(F45:F71))<=1, \"PASS\", \"FAIL\"),\"\"))","v":""},{"$f":"IF(G88=\"INS.DATA\",\"INS.DATA\", IF(G88=\"FAIL\", IF(ABS(AVERAGE(G14:G40)-AVERAGE(G45:G71))<=1, \"PASS\", \"FAIL\"),\"\"))","v":""},{"$f":"IF(H88=\"INS.DATA\",\"INS.DATA\", IF(H88=\"FAIL\", IF(ABS(AVERAGE(H14:H40)-AVERAGE(H45:H71))<=1, \"PASS\", \"FAIL\"),\"\"))","v":""},"",""]
[null,null,"Verified? (Yes/No)",null,null,{"$f":"IF(F88=\"PASS\",\"VERIFIED\", IF(F88=\"INS.DATA\", \"NOT VERIFIED\", IF(AND(F88=\"FAIL\",F89=\"VERIFIED\"),\"YES\", IF(AND(F88=\"FAIL\",F89=\"FAIL\"),\"NOT VERIFIED\",\"\"))))","v":""},{"$f":"IF(G88=\"PASS\",\"VERIFIED\", IF(G88=\"INS.DATA\", \"NOT VERIFIED\", IF(AND(G88=\"FAIL\",G89=\"PASS\"),\"VERIFIED\", IF(AND(G88=\"FAIL\",G89=\"FAIL\"),\"NOT VERIFIED\",\"\"))))","v":""},{"$f":"IF(H88=\"PASS\",\"VERIFIED\", IF(H88=\"INS.DATA\", \"NOT VERIFIED\", IF(AND(H88=\"FAIL\",H89=\"PASS\"),\"VERIFIED\", IF(AND(H88=\"FAIL\",H89=\"FAIL\"),\"NOT VERIFIED\",\"\"))))","v":""},{"$f":"IF(I88=\"PASS\",\"VERIFIED\", IF(I88=\"INS.DATA\", \"NNOT VERIFIED\", IF(AND(I88=\"FAIL\",I89=\"PASS\"),\"VERIFIED\", IF(AND(I88=\"FAIL\",I89=\"FAIL\"),\"NOT VERIFIED\",\"\"))))","v":""},{"$f":"IF(J88=\"PASS\",\"VERIFIED\", IF(J88=\"INS.DATA\", \"NOT VERIFIED\", IF(AND(J88=\"FAIL\",J89=\"PASS\"),\"VERIFIED\", IF(AND(J88=\"FAIL\",J89=\"FAIL\"),\"NOT VERIFIED\",\"\"))))","v":""}]
[]
["Composite Pay Factors"]
[null,null,null,null,"Quality Characteristic","#8","#200","Binder Content","Field Compaction","Air Voids"]
[null,null,null,null,"Weighting Factor (wi)",0.05,0.1,0.25,0.4,0.2]
["Individual \nQuality \nFactors",null,null,null,null,{"$f":"IF(F90=\"VERIFIED\",QCData!BE56,\"Not Verified\")","v":"Not Verified"},{"$f":"IF(G90=\"VERIFIED\",QCData!BF56,\"Not Verified\")","v":"Not Verified"},{"$f":"IF(H90=\"VERIFIED\",QCData!BG56,\"Not Verified\")","v":"Not Verified"},{"$f":"IF(I90=\"VERIFIED\",QCData!BH56,\"Not Verified\")","v":"Not Verified"},{"$f":"IF(J90=\"VERIFIED\",QCData!BI56,\"Not Verified\")","v":"Not Verified"}]
["Composite\nQuality\nFactor"]
[]
[null,null,null,null,"Composite Factor (with method compaction)",{"$f":"ROUND(IF(OR(F95=\"Not Verified\",G95=\"Not Verified\",H95=\"Not Verified\",J95=\"Not Verified\"),\"Not Verified\",F94*F95+G94*G95+H94*H95+I94*1+J94*J95),2)","v":{"$error":"#VALUE!"}},"(waived density)"]
[null,null,null,null,"Composite Factor (with density specifications)",{"$f":"ROUND(IF(OR(F95=\"Not Verified\",G95=\"Not Verified\",H95=\"Not Verified\",I95=\"Not Verified\",J95=\"Not Verified\"),\"Not Verified\",F94*F95+G94*G95+H94*H95+I94*I95+J94*J95),2)","v":{"$error":"#VALUE!"}},"(with density)"]
["Payment"]
[null,null,null,null,{"$f":"\"HMA Total Tonage in Lot No \"&lotno","v":"HMA Total Tonage in Lot No "},17890.12,{"$f":"\"tons, of HMA at bid price=  $\"&unitprice&\" per ton\"","v":"tons, of HMA at bid price=  $ per ton"}]
[null,null,null,null," -  Total Tonage (with waived density)",1142,{"$f":"\"tons. Payment Adustment (waived density testing)@; $\"&ROUND((F98-1)*unitprice,2)&\" per ton\"","v":{"$error":"#VALUE!"}},null,{"$f":"ROUND((F98-1)*F102,2)*unitprice","v":{"$error":"#VALUE!"}}]
[null,null,null,null,"HMA tonage (using density specifications)",{"$f":"F101-F102","v":16748.12},{"$f":"\"tons. Payment Adustment (using density testing)@; $\"&ROUND((F99-1)*unitprice,2)&\" per ton\"","v":{"$error":"#VALUE!"}},null,{"$f":"ROUND((F99-1)*unitprice,2)*F103","v":{"$error":"#VALUE!"}}]
[null,null,null,null,null,null,null,{"$f":"\"Lot \"&lotno&\" Total Payment Adjustment\"","v":"Lot  Total Payment Adjustment"},{"$f":"SUM(I102:I103)","v":{"$error":"#VALUE!"}}]

{"sheet":"F Table","index":3,"n_rows":35,"n_cols":33,"rows_kept":35,"cut":false,"hidden":true,"merged":[[3,3,3,32],[5,1,26,1]]}
[null,"Note: to simplify using the vlookup function on the LotXPay worksheet the  table was flipped diagonally.  Typically this table has the denominator values along the left edge and the Numerator across the top."]
[]
[]
[null,null,null,"Degree of Freedom (nc-1) for Denominator"]
[null,null,null,1,2,3,4,5,6,7,8,9,10,11,12,13,14,15,16,17,18,19,20,21,22,23,24,25,26,27,28,29,30]
[null,"Degree of freedom ( (nv-1) for Numerator",1,647.79999999999995,38.51,17.440000000000001,12.22,10.01,8.81,8.07,7.57,7.21,6.94,6.72,6.55,6.41,6.3,6.2,6.12,6.04,5.98,5.92,5.87,5.83,5.79,5.75,5.72,5.69,5.66,5.63,5.61,5.59,5.57]
[null,null,2,799.5,39,16.04,10.65,8.43,7.26,6.54,6.06,5.71,5.46,5.26,5.0999999999999996,4.97,4.8600000000000003,4.7699999999999996,4.6900000000000004,4.62,4.5599999999999996,4.51,4.46,4.42,4.38,4.3499999999999996,4.32,4.29,4.2699999999999996,4.24,4.22,4.2,4.18]
[null,null,3,864.2,39.17,15.44,9.98,7.76,6.6,5.89,5.42,5.08,4.83,4.63,4.47,4.3499999999999996,4.24,4.1500000000000004,4.08,4.01,3.95,3.9,3.86,3.82,3.78,3.75,3.72,3.69,3.67,3.65,3.63,3.61,3.59]
[null,null,4,899.6,39.25,15.1,9.6,7.39,6.23,5.52,5.05,4.72,4.47,4.28,4.12,4,3.89,3.8,3.73,3.66,3.61,3.56,3.51,3.48,3.44,3.41,3.38,3.35,3.33,3.31,3.29,3.27,3.25]
[null,null,5,921.8,39.299999999999997,14.88,9.36,7.15,5.99,5.29,4.82,4.4800000000000004,4.24,4.04,3.89,3.77,3.66,3.58,3.5,3.44,3.38,3.33,3.29,3.25,3.22,3.18,3.15,3.13,3.1,3.08,3.06,3.04,3.03]
[null,null,6,937.1,39.33,14.73,9.1999999999999993,6.98,5.82,5.12,4.6500000000000004,4.32,4.07,3.88,3.73,3.6,3.5,3.41,3.34,3.28,3.22,3.17,3.13,3.09,3.05,3.02,2.99,2.97,2.94,2.92,2.9,2.88,2.87]
[null,null,7,948.2,39.36,14.62,9.07,6.85,5.7,4.99,4.53,4.2,3.95,3.76,3.61,3.48,3.38,3.29,3.22,3.16,3.1,3.05,3.01,2.97,2.93,2.9,2.87,2.85,2.82,2.8,2.78,2.76,2.75]
[null,null,8,956.7,39.369999999999997,14.54,8.98,6.76,5.6,4.9000000000000004,4.43,4.0999999999999996,3.85,3.66,3.51,3.39,3.29,3.2,3.12,3.06,3.01,2.96,2.91,2.87,2.84,2.81,2.78,2.75,2.73,2.71,2.69,2.67,2.65]
[null,null,9,963.3,39.39,14.47,8.9,6.68,5.52,4.82,4.3600000000000003,4.03,3.78,3.59,3.44,3.31,3.21,3.12,3.05,2.98,2.93,2.88,2.84,2.8,2.76,2.73,2.7,2.68,2.65,2.63,2.61,2.59,2.57]
[null,null,10,968.6,39.4,14.42,8.84,6.62,5.46,4.76,4.3,3.96,3.72,3.53,3.37,3.25,3.15,3.06,2.99,2.92,2.87,2.82,2.77,2.73,2.7,2.67,2.64,2.61,2.59,2.57,2.5499999999999998,2.5299999999999998,2.5099999999999998]
[null,null,11,{"$f":"ROUND(AVERAGE(D15,D17),3)","v":972.65},{"$f":"ROUND(AVERAGE(E15,E17),3)","v":39.405000000000001},14.38,8.7949999999999999,6.57,5.415,4.7149999999999999,4.25,3.915,3.67,3.48,3.3250000000000002,3.2,3.1,3.01,2.94,2.87,2.82,2.77,2.7250000000000001,2.6850000000000001,2.65,2.62,2.59,2.56,2.54,2.52,2.5,2.48,2.46]
[null,null,12,976.7,39.409999999999997,14.34,8.75,6.52,5.37,4.67,4.2,3.87,3.62,3.43,3.28,3.15,3.05,2.96,2.89,2.82,2.77,2.72,2.68,2.64,2.6,2.57,2.54,2.5099999999999998,2.4900000000000002,2.4700000000000002,2.4500000000000002,2.4300000000000002,2.41]
[null,null,13,{"$f":"ROUND(D17+((D20-D17)*(1/3)),3)","v":979.43299999999999},{"$f":"ROUND(E17+((E20-E17)*(1/3)),3)","v":39.417000000000002},14.31,8.7200000000000006,6.49,5.3369999999999997,4.6369999999999996,4.1669999999999998,3.8370000000000002,3.5870000000000002,3.3969999999999998,3.2469999999999999,3.117,3.0169999999999999,2.927,2.8570000000000002,2.7869999999999999,2.7370000000000001,2.6869999999999998,2.6429999999999998,2.6030000000000002,2.5670000000000002,2.5369999999999999,2.5070000000000001,2.4769999999999999,2.4569999999999999,2.4329999999999998,2.4129999999999998,2.3929999999999998,2.3769999999999998]
[null,null,14,{"$f":"ROUND(D20-((D20-D17)*(1/3)),3)","v":982.16700000000003},{"$f":"ROUND(E20-((E20-E17)*(1/3)),3)","v":39.423000000000002},14.28,8.69,6.46,5.3029999999999999,4.6029999999999998,4.133,3.8029999999999999,3.5529999999999999,3.363,3.2130000000000001,3.0830000000000002,2.9830000000000001,2.8929999999999998,2.823,2.7530000000000001,2.7029999999999998,2.653,2.6070000000000002,2.5670000000000002,2.5329999999999999,2.5030000000000001,2.4729999999999999,2.4430000000000001,2.423,2.3969999999999998,2.3769999999999998,2.3570000000000002,2.343]
[null,null,15,984.9,39.43,14.25,8.66,6.43,5.27,4.57,4.0999999999999996,3.77,3.52,3.33,3.18,3.05,2.95,2.86,2.79,2.72,2.67,2.62,2.57,2.5299999999999998,2.5,2.4700000000000002,2.44,2.41,2.39,2.36,2.34,2.3199999999999998,2.31]
[null,null,16,{"$f":"ROUND(D$20+((1/5)*(D$25-D$20)),3)","v":986.54},{"$f":"ROUND(E$20+((1/5)*(E$25-E$20)),3)","v":39.433999999999997},14.234,8.64,6.41,5.25,4.55,4.08,3.75,3.5,3.31,3.1579999999999999,3.03,2.9279999999999999,2.84,2.7679999999999998,2.7,2.6480000000000001,2.5979999999999999,2.548,2.508,2.4780000000000002,2.448,2.4180000000000001,2.3879999999999999,2.3679999999999999,2.3380000000000001,2.3180000000000001,2.298,2.2879999999999998]
[null,null,17,{"$f":"ROUND(D$20+((2/5)*(D$25-D$20)),3)","v":988.18},{"$f":"ROUND(E$20+((2/5)*(E$25-E$20)),3)","v":39.438000000000002},14.218,8.6199999999999992,6.39,5.23,4.53,4.0599999999999996,3.73,3.48,3.29,3.1360000000000001,3.01,2.9060000000000001,2.82,2.746,2.68,2.6259999999999999,2.5760000000000001,2.5259999999999998,2.4860000000000002,2.456,2.4260000000000002,2.3959999999999999,2.3660000000000001,2.3460000000000001,2.3159999999999998,2.2959999999999998,2.2759999999999998,2.266]
[null,null,18,{"$f":"ROUND(D$20+((3/5)*(D$25-D$20)),3)","v":989.82},{"$f":"ROUND(E$20+((3/5)*(E$25-E$20)),3)","v":39.442},14.202,8.6,6.37,5.21,4.51,4.04,3.71,3.46,3.27,3.1139999999999999,2.99,2.8839999999999999,2.8,2.7240000000000002,2.66,2.6040000000000001,2.5539999999999998,2.504,2.464,2.4340000000000002,2.4039999999999999,2.3740000000000001,2.3439999999999999,2.3239999999999998,2.294,2.274,2.254,2.2440000000000002]
[null,null,19,{"$f":"ROUND(D$20+((4/5)*(D$25-D$20)),3)","v":991.46},{"$f":"ROUND(E$20+((4/5)*(E$25-E$20)),3)","v":39.445999999999998},14.186,8.58,6.35,5.19,4.49,4.0199999999999996,3.69,3.44,3.25,3.0920000000000001,2.97,2.8620000000000001,2.78,2.702,2.64,2.5819999999999999,2.532,2.4820000000000002,2.4420000000000002,2.4119999999999999,2.3820000000000001,2.3519999999999999,2.3220000000000001,2.302,2.2719999999999998,2.2519999999999998,2.2320000000000002,2.222]
[null,null,20,993.1,39.450000000000003,14.17,8.56,6.33,5.17,4.47,4,3.67,3.42,3.23,3.07,2.95,2.84,2.76,2.68,2.62,2.56,2.5099999999999998,2.46,2.42,2.39,2.36,2.33,2.2999999999999998,2.2799999999999998,2.25,2.23,2.21,2.2000000000000002]
[null,null,24,997.2,39.46,14.12,8.51,6.28,5.12,4.42,3.95,3.61,3.37,3.17,3.02,2.89,2.79,2.7,2.63,2.56,2.5,2.4500000000000002,2.41,2.37,2.33,2.2999999999999998,2.27,2.2400000000000002,2.2200000000000002,2.19,2.17,2.15,2.14]
[null,null,30,1001,39.46,14.08,8.4600000000000009,6.23,5.07,4.3600000000000003,3.89,3.56,3.31,3.12,2.96,2.84,2.73,2.64,2.57,2.5,2.44,2.39,2.35,2.31,2.27,2.2400000000000002,2.21,2.1800000000000002,2.16,2.13,2.11,2.09,2.0699999999999998]
[]
[]
[]
[null,null,"Level of Confidence 0.025  (aka alpha, α)"]
[]
[]
[]
[null,null,"The green cells above indicate values that were developed using a straightline interpolation.  Before taking this step, plots of the other values were reviewed and determined that a straightline interpretation was appropriate."]

{"sheet":"TCrit","index":4,"n_rows":40,"n_cols":2,"rows_kept":40,"cut":false,"hidden":true,"merged":[]}
["Table 39-5 - CRITICAL t-VALUE FOR VERIFICATION OF QUALITY CONTROL TESTING"]
[]
[]
["(for  = 0.025)"]
["(nc+nv-2)","tcrit"]
[]
[1,24.452000000000002]
[2,6.2050000000000001]
[3,4.1769999999999996]
[4,3.4950000000000001]
[5,3.1629999999999998]
[6,2.9689999999999999]
[7,2.8410000000000002]
[8,2.7519999999999998]
[9,2.6850000000000001]
[10,2.6339999999999999]
[11,2.593]
[12,2.56]
[13,2.5329999999999999]
[14,2.5099999999999998]
[15,2.4900000000000002]
[16,2.4729999999999999]
[17,2.4580000000000002]
[18,2.4449999999999998]
[19,2.4329999999999998]
[20,2.423]
[21,2.4140000000000001]
[22,2.4049999999999998]
[23,2.3980000000000001]
[24,2.391]
[25,2.3849999999999998]
[26,2.379]
[27,2.3730000000000002]
[28,2.3679999999999999]
[29,2.3639999999999999]
[30,2.36]
[40,2.3290000000000002]
[60,2.2989999999999999]
[120,2.27]
["∞",2.2410000000000001]

{"sheet":"Imported QCData","index":5,"n_rows":56,"n_cols":182,"rows_kept":56,"cut":false,"hidden":true,"merged":[]}
[]
[]
[null,null,"If accepted, data on this sheet will be used to replace the test data on the QCData worksheet"]
[]
[]
[]
[]
[]
[null,"Imported QCData versus Existing QC Data"]
[]
[]
[]
[]
[]
["Instructions: Scroll Down and review highlighted data"]
[]
[null," No Color Change indicates same data as aleady accepted into worksheet."]
[null,"Typically you should only see \"new\" data highlighted blue. Changed or Deleted Data should not be accepted without supporting reason acceptable to the Resident Engineer"]
[null,null,null,null,null,null,null,null,null,null,null,null,null,null,null,null,null,null,null,null,null,null,null,null,null,null,null,null,null,null,null,null,null,null,null,null,null,null,null,null,null,null,null,null,null,null,null,null,null,null,null,null,null,null,null,null,null,null,null,null,null,null,null,null,null,null,null,null,null,null,null,null,null,null,null,null,null,null,null,null,null,null,null,null,null,null,null,null,null,null,null,null,null,null,null,null,null,null,null,null,null,null,null,null,null,null,null,null,null,null,null,null,null,null,null,null,null,null,null,null,null,null,null,null,null,null,null,null,null,null,null,null,null,null,null,null,null,null,null,null,null,null,null,null,null,null,null,null,null,null,null,null,null,null,null,null,"S","<=Indicates same data"]
[null,"Color Coding Legend:",null,null,null,null,null,null,null,null,null,null,null,null,null,null,null,null,null,null,null,null,null,null,null,null,null,null,null,null,null,null,null,null,null,null,null,null,null,null,null,null,null,null,null,null,null,null,null,null,null,null,null,null,null,null,null,null,null,null,null,null,null,null,null,null,null,null,null,null,null,null,null,null,null,null,null,null,null,null,null,null,null,null,null,null,null,null,null,null,null,null,null,null,null,null,null,null,null,null,null,null,null,null,null,null,null,null,null,null,null,null,null,null,null,null,null,null,null,null,null,null,null,null,null,null,null,null,null,null,null,null,null,null,null,null,null,null,null,null,null,null,null,null,null,null,null,null,null,null,null,null,null,null,null,null,"N","<=Indicates new data"]
[null,"Same","<=Indicates new data",null,null,null,null,null,null,null,null,null,null,null,null,null,null,null,null,null,null,null,null,null,null,null,null,null,null,null,null,null,null,null,null,null,null,null,null,null,null,null,null,null,null,null,null,null,null,null,null,null,null,null,null,null,null,null,null,null,null,null,null,null,null,null,null,null,null,null,null,null,null,null,null,null,null,null,null,null,null,null,null,null,null,null,null,null,null,null,null,null,null,null,null,null,null,null,null,null,null,null,null,null,null,null,null,null,null,null,null,null,null,null,null,null,null,null,null,null,null,null,null,null,null,null,null,null,null,null,null,null,null,null,null,null,null,null,null,null,null,null,null,null,null,null,null,null,null,null,null,null,null,null,null,null,"C","<=Indicates cell with changed data"]
[null,"New","<=Indicates new data",null,null,null,null,null,null,null,null,null,null,null,null,null,null,null,null,null,null,null,null,null,null,null,null,null,null,null,null,null,null,null,null,null,null,null,null,null,null,null,null,null,null,null,null,null,null,null,null,null,null,null,null,null,null,null,null,null,null,null,null,null,null,null,null,null,null,null,null,null,null,null,null,null,null,null,null,null,null,null,null,null,null,null,null,null,null,null,null,null,null,null,null,null,null,null,null,null,null,null,null,null,null,null,null,null,null,null,null,null,null,null,null,null,null,null,null,null,null,null,null,null,null,null,null,null,null,null,null,null,null,null,null,null,null,null,null,null,null,null,null,null,null,null,null,null,null,null,null,null,null,null,null,null,"D","<=Indicates data was deleted "]
[null,"Changed","<=Indicates cell with changed data"]
[null,"Deleted","<=Indicates data was deleted "]
[]
[]
["TEST NO.","Date","Tons in sublot","Lot No.","Sublot No","3 Out","2\"","1-1/2\"","1\"","3/4\"","1/2\"","3/8\"","#4","#8","#16","#30","#50","#100","#200","B.C.",null,null,null,null,null,null,null,null,null,null,null,null,null,null,null,null,null,null,null,null,null,null,null,null,null,null,null,null,null,null,null,null,"Import data to here (BA30:Z56)"]
[null,null,"using \"Method\"",null,null,"in 1 Day?",null,null,null,null,null,null,null,null,null,null,null,null,null,null,"%MTD","%MTD","%MTD","Briquette 1","Briquette 2","Briquette 3"]
[null,null,"Compaction",null,null,"Yes or NO",null,null,null,null,null,null,null,null,null,null,null,null,null,null,"Core 1","Core 2","Core 3","Air Voids","Air Voids","Air Voids"]
[{"$f":"IF(BA30=\"\",\"\",BA30)","v":1},{"$f":"IF(BB30=\"\",\"\",BB30)","v":"2008-09-11"},0,1,1,"NO","","",100,99,84,77,46,35,29,11,"","",5,5.3,93.1,94.1,95.1,3.9,4,4.0999999999999996,null,null,null,null,null,null,null,null,null,null,null,null,null,null,null,null,null,null,null,null,null,null,null,null,null,null,1,39702,0,1,1,"NO",null,null,100,99,84,77,46,35,29,11,null,null,5,5.3,93.1,94.1,95.1,3.9,4,4.0999999999999996,null,null,null,null,null,null,null,null,null,null,null,null,null,null,null,null,null,null,null,null,null,null,null,null,null,null,null,null,null,null,null,null,null,null,null,null,null,null,null,null,null,null,null,null,null,null,null,null,null,null,null,null,null,null,null,null,null,null,null,null,null,null,null,null,null,null,null,null,null,null,null,null,null,null,null,null,null,null,{"$f":"IF(A30=QCData!A30,\"S\",IF(AND(A30<>\"\",QCData!A30=\"\"),\"N\",IF(AND(A30<>\"\",QCData!A30<>\"\",A30<>QCData!A30),\"C\",IF(AND(QCData!A30<>\"\",A30=\"\"),\"D\",\"no cd er\"))))","v":"N"},{"$f":"IF(B30=QCData!B30,\"S\",IF(AND(B30<>\"\",QCData!B30=\"\"),\"N\",IF(AND(B30<>\"\",QCData!B30<>\"\",B30<>QCData!B30),\"C\",IF(AND(QCData!B30<>\"\",B30=\"\"),\"D\",\"no cd er\"))))","v":"N"},{"$f":"IF(C30=QCData!C30,\"S\",IF(AND(C30<>\"\",QCData!C30=\"\"),\"N\",IF(AND(C30<>\"\",QCData!C30<>\"\",C30<>QCData!C30),\"C\",IF(AND(QCData!C30<>\"\",C30=\"\"),\"D\",\"no cd er\"))))","v":"S"},{"$f":"IF(D30=QCData!D30,\"S\",IF(AND(D30<>\"\",QCData!D30=\"\"),\"N\",IF(AND(D30<>\"\",QCData!D30<>\"\",D30<>QCData!D30),\"C\",IF(AND(QCData!D30<>\"\",D30=\"\"),\"D\",\"no cd er\"))))","v":"N"},{"$f":"IF(E30=QCData!E30,\"S\",IF(AND(E30<>\"\",QCData!E30=\"\"),\"N\",IF(AND(E30<>\"\",QCData!E30<>\"\",E30<>QCData!E30),\"C\",IF(AND(QCData!E30<>\"\",E30=\"\"),\"D\",\"no cd er\"))))","v":"N"},{"$f":"IF(F30=QCData!F30,\"S\",IF(AND(F30<>\"\",QCData!F30=\"\"),\"N\",IF(AND(F30<>\"\",QCData!F30<>\"\",F30<>QCData!F30),\"C\",IF(AND(QCData!F30<>\"\",F30=\"\"),\"D\",\"no cd er\"))))","v":"N"},{"$f":"IF(G30=QCData!G30,\"S\",IF(AND(G30<>\"\",QCData!G30=\"\"),\"N\",IF(AND(G30<>\"\",QCData!G30<>\"\",G30<>QCData!G30),\"C\",IF(AND(QCData!G30<>\"\",G30=\"\"),\"D\",\"no cd er\"))))","v":"S"},{"$f":"IF(H30=QCData!H30,\"S\",IF(AND(H30<>\"\",QCData!H30=\"\"),\"N\",IF(AND(H30<>\"\",QCData!H30<>\"\",H30<>QCData!H30),\"C\",IF(AND(QCData!H30<>\"\",H30=\"\"),\"D\",\"no cd er\"))))","v":"S"},{"$f":"IF(I30=QCData!I30,\"S\",IF(AND(I30<>\"\",QCData!I30=\"\"),\"N\",IF(AND(I30<>\"\",QCData!I30<>\"\",I30<>QCData!I30),\"C\",IF(AND(QCData!I30<>\"\",I30=\"\"),\"D\",\"no cd er\"))))","v":"N"},{"$f":"IF(J30=QCData!J30,\"S\",IF(AND(J30<>\"\",QCData!J30=\"\"),\"N\",IF(AND(J30<>\"\",QCData!J30<>\"\",J30<>QCData!J30),\"C\",IF(AND(QCData!J30<>\"\",J30=\"\"),\"D\",\"no cd er\"))))","v":"N"},{"$f":"IF(K30=QCData!K30,\"S\",IF(AND(K30<>\"\",QCData!K30=\"\"),\"N\",IF(AND(K30<>\"\",QCData!K30<>\"\",K30<>QCData!K30),\"C\",IF(AND(QCData!K30<>\"\",K30=\"\"),\"D\",\"no cd er\"))))","v":"N"},{"$f":"IF(L30=QCData!L30,\"S\",IF(AND(L30<>\"\",QCData!L30=\"\"),\"N\",IF(AND(L30<>\"\",QCData!L30<>\"\",L30<>QCData!L30),\"C\",IF(AND(QCData!L30<>\"\",L30=\"\"),\"D\",\"no cd er\"))))","v":"N"},{"$f":"IF(M30=QCData!M30,\"S\",IF(AND(M30<>\"\",QCData!M30=\"\"),\"N\",IF(AND(M30<>\"\",QCData!M30<>\"\",M30<>QCData!M30),\"C\",IF(AND(QCData!M30<>\"\",M30=\"\"),\"D\",\"no cd er\"))))","v":"N"},{"$f":"IF(N30=QCData!N30,\"S\",IF(AND(N30<>\"\",QCData!N30=\"\"),\"N\",IF(AND(N30<>\"\",QCData!N30<>\"\",N30<>QCData!N30),\"C\",IF(AND(QCData!N30<>\"\",N30=\"\"),\"D\",\"no cd er\"))))","v":"N"},{"$f":"IF(O30=QCData!O30,\"S\",IF(AND(O30<>\"\",QCData!O30=\"\"),\"N\",IF(AND(O30<>\"\",QCData!O30<>\"\",O30<>QCData!O30),\"C\",IF(AND(QCData!O30<>\"\",O30=\"\"),\"D\",\"no cd er\"))))","v":"N"},{"$f":"IF(P30=QCData!P30,\"S\",IF(AND(P30<>\"\",QCData!P30=\"\"),\"N\",IF(AND(P30<>\"\",QCData!P30<>\"\",P30<>QCData!P30),\"C\",IF(AND(QCData!P30<>\"\",P30=\"\"),\"D\",\"no cd er\"))))","v":"N"},{"$f":"IF(Q30=QCData!Q30,\"S\",IF(AND(Q30<>\"\",QCData!Q30=\"\"),\"N\",IF(AND(Q30<>\"\",QCData!Q30<>\"\",Q30<>QCData!Q30),\"C\",IF(AND(QCData!Q30<>\"\",Q30=\"\"),\"D\",\"no cd er\"))))","v":"S"},{"$f":"IF(R30=QCData!R30,\"S\",IF(AND(R30<>\"\",QCData!R30=\"\"),\"N\",IF(AND(R30<>\"\",QCData!R30<>\"\",R30<>QCData!R30),\"C\",IF(AND(QCData!R30<>\"\",R30=\"\"),\"D\",\"no cd er\"))))","v":"S"},{"$f":"IF(S30=QCData!S30,\"S\",IF(AND(S30<>\"\",QCData!S30=\"\"),\"N\",IF(AND(S30<>\"\",QCData!S30<>\"\",S30<>QCData!S30),\"C\",IF(AND(QCData!S30<>\"\",S30=\"\"),\"D\",\"no cd er\"))))","v":"N"},{"$f":"IF(T30=QCData!T30,\"S\",IF(AND(T30<>\"\",QCData!T30=\"\"),\"N\",IF(AND(T30<>\"\",QCData!T30<>\"\",T30<>QCData!T30),\"C\",IF(AND(QCData!T30<>\"\",T30=\"\"),\"D\",\"no cd er\"))))","v":"N"},{"$f":"IF(U30=QCData!U30,\"S\",IF(AND(U30<>\"\",QCData!U30=\"\"),\"N\",IF(AND(U30<>\"\",QCData!U30<>\"\",U30<>QCData!U30),\"C\",IF(AND(QCData!U30<>\"\",U30=\"\"),\"D\",\"no cd er\"))))","v":"N"},{"$f":"IF(V30=QCData!V30,\"S\",IF(AND(V30<>\"\",QCData!V30=\"\"),\"N\",IF(AND(V30<>\"\",QCData!V30<>\"\",V30<>QCData!V30),\"C\",IF(AND(QCData!V30<>\"\",V30=\"\"),\"D\",\"no cd er\"))))","v":"N"},{"$f":"IF(W30=QCData!W30,\"S\",IF(AND(W30<>\"\",QCData!W30=\"\"),\"N\",IF(AND(W30<>\"\",QCData!W30<>\"\",W30<>QCData!W30),\"C\",IF(AND(QCData!W30<>\"\",W30=\"\"),\"D\",\"no cd er\"))))","v":"N"},{"$f":"IF(X30=QCData!X30,\"S\",IF(AND(X30<>\"\",QCData!X30=\"\"),\"N\",IF(AND(X30<>\"\",QCData!X30<>\"\",X30<>QCData!X30),\"C\",IF(AND(QCData!X30<>\"\",X30=\"\"),\"D\",\"no cd er\"))))","v":"N"},{"$f":"IF(Y30=QCData!Y30,\"S\",IF(AND(Y30<>\"\",QCData!Y30=\"\"),\"N\",IF(AND(Y30<>\"\",QCData!Y30<>\"\",Y30<>QCData!Y30),\"C\",IF(AND(QCData!Y30<>\"\",Y30=\"\"),\"D\",\"no cd er\"))))","v":"N"},{"$f":"IF(Z30=QCData!Z30,\"S\",IF(AND(Z30<>\"\",QCData!Z30=\"\"),\"N\",IF(AND(Z30<>\"\",QCData!Z30<>\"\",Z30<>QCData!Z30),\"C\",IF(AND(QCData!Z30<>\"\",Z30=\"\"),\"D\",\"no cd er\"))))","v":"N"}]
[{"$f":"IF(BA31=\"\",\"\",BA31)","v":2},{"$f":"IF(BB31=\"\",\"\",BB31)","v":""},{"$f":"IF(BC31=\"\",\"\",BC31)","v":0},{"$f":"IF(BD31=\"\",\"\",BD31)","v":1},{"$f":"IF(BE31=\"\",\"\",BE31)","v":2},{"$f":"IF(BF31=\"\",\"\",BF31)","v":"NO"},{"$f":"IF(BG31=\"\",\"\",BG31)","v":""},{"$f":"IF(BH31=\"\",\"\",BH31)","v":""},{"$f":"IF(BI31=\"\",\"\",BI31)","v":100},{"$f":"IF(BJ31=\"\",\"\",BJ31)","v":94},{"$f":"IF(BK31=\"\",\"\",BK31)","v":82},{"$f":"IF(BL31=\"\",\"\",BL31)","v":76},{"$f":"IF(BM31=\"\",\"\",BM31)","v":46},{"$f":"IF(BN31=\"\",\"\",BN31)","v":36},{"$f":"IF(BO31=\"\",\"\",BO31)","v":23},{"$f":"IF(BP31=\"\",\"\",BP31)","v":12},{"$f":"IF(BQ31=\"\",\"\",BQ31)","v":""},{"$f":"IF(BR31=\"\",\"\",BR31)","v":""},{"$f":"IF(BS31=\"\",\"\",BS31)","v":4.9000000000000004},{"$f":"IF(BT31=\"\",\"\",BT31)","v":5.2},{"$f":"IF(BU31=\"\",\"\",BU31)","v":93.4},{"$f":"IF(BV31=\"\",\"\",BV31)","v":92.1},{"$f":"IF(BW31=\"\",\"\",BW31)","v":92.1},{"$f":"IF(BX31=\"\",\"\",BX31)","v":""},{"$f":"IF(BY31=\"\",\"\",BY31)","v":""},{"$f":"IF(BZ31=\"\",\"\",BZ31)","v":""},null,null,null,null,null,null,null,null,null,null,null,null,null,null,null,null,null,null,null,null,null,null,null,null,null,null,2,null,0,1,2,"NO",null,null,100,94,82,76,46,36,23,12,null,null,4.9000000000000004,5.2,93.4,92.1,92.1,null,null,null,null,null,null,null,null,null,null,null,null,null,null,null,null,null,null,null,null,null,null,null,null,null,null,null,null,null,null,null,null,null,null,null,null,null,null,null,null,null,null,null,null,null,null,null,null,null,null,null,null,null,null,null,null,null,null,null,null,null,null,null,null,null,null,null,null,null,null,null,null,null,null,null,null,null,null,null,null,null,{"$f":"IF(A31=QCData!A31,\"S\",IF(AND(A31<>\"\",QCData!A31=\"\"),\"N\",IF(AND(A31<>\"\",QCData!A31<>\"\",A31<>QCData!A31),\"C\",IF(AND(QCData!A31<>\"\",A31=\"\"),\"D\",\"no cd er\"))))","v":"N"},{"$f":"IF(B31=QCData!B31,\"S\",IF(AND(B31<>\"\",QCData!B31=\"\"),\"N\",IF(AND(B31<>\"\",QCData!B31<>\"\",B31<>QCData!B31),\"C\",IF(AND(QCData!B31<>\"\",B31=\"\"),\"D\",\"no cd er\"))))","v":"S"},{"$f":"IF(C31=QCData!C31,\"S\",IF(AND(C31<>\"\",QCData!C31=\"\"),\"N\",IF(AND(C31<>\"\",QCData!C31<>\"\",C31<>QCData!C31),\"C\",IF(AND(QCData!C31<>\"\",C31=\"\"),\"D\",\"no cd er\"))))","v":"S"},{"$f":"IF(D31=QCData!D31,\"S\",IF(AND(D31<>\"\",QCData!D31=\"\"),\"N\",IF(AND(D31<>\"\",QCData!D31<>\"\",D31<>QCData!D31),\"C\",IF(AND(QCData!D31<>\"\",D31=\"\"),\"D\",\"no cd er\"))))","v":"N"},{"$f":"IF(E31=QCData!E31,\"S\",IF(AND(E31<>\"\",QCData!E31=\"\"),\"N\",IF(AND(E31<>\"\",QCData!E31<>\"\",E31<>QCData!E31),\"C\",IF(AND(QCData!E31<>\"\",E31=\"\"),\"D\",\"no cd er\"))))","v":"N"},{"$f":"IF(F31=QCData!F31,\"S\",IF(AND(F31<>\"\",QCData!F31=\"\"),\"N\",IF(AND(F31<>\"\",QCData!F31<>\"\",F31<>QCData!F31),\"C\",IF(AND(QCData!F31<>\"\",F31=\"\"),\"D\",\"no cd er\"))))","v":"N"},{"$f":"IF(G31=QCData!G31,\"S\",IF(AND(G31<>\"\",QCData!G31=\"\"),\"N\",IF(AND(G31<>\"\",QCData!G31<>\"\",G31<>QCData!G31),\"C\",IF(AND(QCData!G31<>\"\",G31=\"\"),\"D\",\"no cd er\"))))","v":"S"},{"$f":"IF(H31=QCData!H31,\"S\",IF(AND(H31<>\"\",QCData!H31=\"\"),\"N\",IF(AND(H31<>\"\",QCData!H31<>\"\",H31<>QCData!H31),\"C\",IF(AND(QCData!H31<>\"\",H31=\"\"),\"D\",\"no cd er\"))))","v":"S"},{"$f":"IF(I31=QCData!I31,\"S\",IF(AND(I31<>\"\",QCData!I31=\"\"),\"N\",IF(AND(I31<>\"\",QCData!I31<>\"\",I31<>QCData!I31),\"C\",IF(AND(QCData!I31<>\"\",I31=\"\"),\"D\",\"no cd er\"))))","v":"N"},{"$f":"IF(J31=QCData!J31,\"S\",IF(AND(J31<>\"\",QCData!J31=\"\"),\"N\",IF(AND(J31<>\"\",QCData!J31<>\"\",J31<>QCData!J31),\"C\",IF(AND(QCData!J31<>\"\",J31=\"\"),\"D\",\"no cd er\"))))","v":"N"},{"$f":"IF(K31=QCData!K31,\"S\",IF(AND(K31<>\"\",QCData!K31=\"\"),\"N\",IF(AND(K31<>\"\",QCData!K31<>\"\",K31<>QCData!K31),\"C\",IF(AND(QCData!K31<>\"\",K31=\"\"),\"D\",\"no cd er\"))))","v":"N"},{"$f":"IF(L31=QCData!L31,\"S\",IF(AND(L31<>\"\",QCData!L31=\"\"),\"N\",IF(AND(L31<>\"\",QCData!L31<>\"\",L31<>QCData!L31),\"C\",IF(AND(QCData!L31<>\"\",L31=\"\"),\"D\",\"no cd er\"))))","v":"N"},{"$f":"IF(M31=QCData!M31,\"S\",IF(AND(M31<>\"\",QCData!M31=\"\"),\"N\",IF(AND(M31<>\"\",QCData!M31<>\"\",M31<>QCData!M31),\"C\",IF(AND(QCData!M31<>\"\",M31=\"\"),\"D\",\"no cd er\"))))","v":"N"},{"$f":"IF(N31=QCData!N31,\"S\",IF(AND(N31<>\"\",QCData!N31=\"\"),\"N\",IF(AND(N31<>\"\",QCData!N31<>\"\",N31<>QCData!N31),\"C\",IF(AND(QCData!N31<>\"\",N31=\"\"),\"D\",\"no cd er\"))))","v":"N"},{"$f":"IF(O31=QCData!O31,\"S\",IF(AND(O31<>\"\",QCData!O31=\"\"),\"N\",IF(AND(O31<>\"\",QCData!O31<>\"\",O31<>QCData!O31),\"C\",IF(AND(QCData!O31<>\"\",O31=\"\"),\"D\",\"no cd er\"))))","v":"N"},{"$f":"IF(P31=QCData!P31,\"S\",IF(AND(P31<>\"\",QCData!P31=\"\"),\"N\",IF(AND(P31<>\"\",QCData!P31<>\"\",P31<>QCData!P31),\"C\",IF(AND(QCData!P31<>\"\",P31=\"\"),\"D\",\"no cd er\"))))","v":"N"},{"$f":"IF(Q31=QCData!Q31,\"S\",IF(AND(Q31<>\"\",QCData!Q31=\"\"),\"N\",IF(AND(Q31<>\"\",QCData!Q31<>\"\",Q31<>QCData!Q31),\"C\",IF(AND(QCData!Q31<>\"\",Q31=\"\"),\"D\",\"no cd er\"))))","v":"S"},{"$f":"IF(R31=QCData!R31,\"S\",IF(AND(R31<>\"\",QCData!R31=\"\"),\"N\",IF(AND(R31<>\"\",QCData!R31<>\"\",R31<>QCData!R31),\"C\",IF(AND(QCData!R31<>\"\",R31=\"\"),\"D\",\"no cd er\"))))","v":"S"},{"$f":"IF(S31=QCData!S31,\"S\",IF(AND(S31<>\"\",QCData!S31=\"\"),\"N\",IF(AND(S31<>\"\",QCData!S31<>\"\",S31<>QCData!S31),\"C\",IF(AND(QCData!S31<>\"\",S31=\"\"),\"D\",\"no cd er\"))))","v":"N"},{"$f":"IF(T31=QCData!T31,\"S\",IF(AND(T31<>\"\",QCData!T31=\"\"),\"N\",IF(AND(T31<>\"\",QCData!T31<>\"\",T31<>QCData!T31),\"C\",IF(AND(QCData!T31<>\"\",T31=\"\"),\"D\",\"no cd er\"))))","v":"N"},{"$f":"IF(U31=QCData!U31,\"S\",IF(AND(U31<>\"\",QCData!U31=\"\"),\"N\",IF(AND(U31<>\"\",QCData!U31<>\"\",U31<>QCData!U31),\"C\",IF(AND(QCData!U31<>\"\",U31=\"\"),\"D\",\"no cd er\"))))","v":"N"},{"$f":"IF(V31=QCData!V31,\"S\",IF(AND(V31<>\"\",QCData!V31=\"\"),\"N\",IF(AND(V31<>\"\",QCData!V31<>\"\",V31<>QCData!V31),\"C\",IF(AND(QCData!V31<>\"\",V31=\"\"),\"D\",\"no cd er\"))))","v":"N"},{"$f":"IF(W31=QCData!W31,\"S\",IF(AND(W31<>\"\",QCData!W31=\"\"),\"N\",IF(AND(W31<>\"\",QCData!W31<>\"\",W31<>QCData!W31),\"C\",IF(AND(QCData!W31<>\"\",W31=\"\"),\"D\",\"no cd er\"))))","v":"N"},{"$f":"IF(X31=QCData!X31,\"S\",IF(AND(X31<>\"\",QCData!X31=\"\"),\"N\",IF(AND(X31<>\"\",QCData!X31<>\"\",X31<>QCData!X31),\"C\",IF(AND(QCData!X31<>\"\",X31=\"\"),\"D\",\"no cd er\"))))","v":"S"},{"$f":"IF(Y31=QCData!Y31,\"S\",IF(AND(Y31<>\"\",QCData!Y31=\"\"),\"N\",IF(AND(Y31<>\"\",QCData!Y31<>\"\",Y31<>QCData!Y31),\"C\",IF(AND(QCData!Y31<>\"\",Y31=\"\"),\"D\",\"no cd er\"))))","v":"S"},{"$f":"IF(Z31=QCData!Z31,\"S\",IF(AND(Z31<>\"\",QCData!Z31=\"\"),\"N\",IF(AND(Z31<>\"\",QCData!Z31<>\"\",Z31<>QCData!Z31),\"C\",IF(AND(QCData!Z31<>\"\",Z31=\"\"),\"D\",\"no cd er\"))))","v":"S"}]
[{"$f":"IF(BA32=\"\",\"\",BA32)","v":3},{"$f":"IF(BB32=\"\",\"\",BB32)","v":""},{"$f":"IF(BC32=\"\",\"\",BC32)","v":0},{"$f":"IF(BD32=\"\",\"\",BD32)","v":1},{"$f":"IF(BE32=\"\",\"\",BE32)","v":3},{"$f":"IF(BF32=\"\",\"\",BF32)","v":"NO"},{"$f":"IF(BG32=\"\",\"\",BG32)","v":""},{"$f":"IF(BH32=\"\",\"\",BH32)","v":""},{"$f":"IF(BI32=\"\",\"\",BI32)","v":100},{"$f":"IF(BJ32=\"\",\"\",BJ32)","v":93},{"$f":"IF(BK32=\"\",\"\",BK32)","v":84},{"$f":"IF(BL32=\"\",\"\",BL32)","v":76},{"$f":"IF(BM32=\"\",\"\",BM32)","v":44},{"$f":"IF(BN32=\"\",\"\",BN32)","v":42},{"$f":"IF(BO32=\"\",\"\",BO32)","v":35},{"$f":"IF(BP32=\"\",\"\",BP32)","v":13},{"$f":"IF(BQ32=\"\",\"\",BQ32)","v":""},{"$f":"IF(BR32=\"\",\"\",BR32)","v":""},{"$f":"IF(BS32=\"\",\"\",BS32)","v":4.9000000000000004},{"$f":"IF(BT32=\"\",\"\",BT32)","v":5.0999999999999996},{"$f":"IF(BU32=\"\",\"\",BU32)","v":92},{"$f":"IF(BV32=\"\",\"\",BV32)","v":95},{"$f":"IF(BW32=\"\",\"\",BW32)","v":96},{"$f":"IF(BX32=\"\",\"\",BX32)","v":3.5},{"$f":"IF(BY32=\"\",\"\",BY32)","v":3.5},{"$f":"IF(BZ32=\"\",\"\",BZ32)","v":3.6},null,null,null,null,null,null,null,null,null,null,null,null,null,null,null,null,null,null,null,null,null,null,null,null,null,null,3,null,0,1,3,"NO",null,null,100,93,84,76,44,42,35,13,null,null,4.9000000000000004,5.0999999999999996,92,95,96,3.5,3.5,3.6,null,null,null,null,null,null,null,null,null,null,null,null,null,null,null,null,null,null,null,null,null,null,null,null,null,null,null,null,null,null,null,null,null,null,null,null,null,null,null,null,null,null,null,null,null,null,null,null,null,null,null,null,null,null,null,null,null,null,null,null,null,null,null,null,null,null,null,null,null,null,null,null,null,null,null,null,null,null,{"$f":"IF(A32=QCData!A32,\"S\",IF(AND(A32<>\"\",QCData!A32=\"\"),\"N\",IF(AND(A32<>\"\",QCData!A32<>\"\",A32<>QCData!A32),\"C\",IF(AND(QCData!A32<>\"\",A32=\"\"),\"D\",\"no cd er\"))))","v":"N"},{"$f":"IF(B32=QCData!B32,\"S\",IF(AND(B32<>\"\",QCData!B32=\"\"),\"N\",IF(AND(B32<>\"\",QCData!B32<>\"\",B32<>QCData!B32),\"C\",IF(AND(QCData!B32<>\"\",B32=\"\"),\"D\",\"no cd er\"))))","v":"S"},{"$f":"IF(C32=QCData!C32,\"S\",IF(AND(C32<>\"\",QCData!C32=\"\"),\"N\",IF(AND(C32<>\"\",QCData!C32<>\"\",C32<>QCData!C32),\"C\",IF(AND(QCData!C32<>\"\",C32=\"\"),\"D\",\"no cd er\"))))","v":"S"},{"$f":"IF(D32=QCData!D32,\"S\",IF(AND(D32<>\"\",QCData!D32=\"\"),\"N\",IF(AND(D32<>\"\",QCData!D32<>\"\",D32<>QCData!D32),\"C\",IF(AND(QCData!D32<>\"\",D32=\"\"),\"D\",\"no cd er\"))))","v":"N"},{"$f":"IF(E32=QCData!E32,\"S\",IF(AND(E32<>\"\",QCData!E32=\"\"),\"N\",IF(AND(E32<>\"\",QCData!E32<>\"\",E32<>QCData!E32),\"C\",IF(AND(QCData!E32<>\"\",E32=\"\"),\"D\",\"no cd er\"))))","v":"N"},{"$f":"IF(F32=QCData!F32,\"S\",IF(AND(F32<>\"\",QCData!F32=\"\"),\"N\",IF(AND(F32<>\"\",QCData!F32<>\"\",F32<>QCData!F32),\"C\",IF(AND(QCData!F32<>\"\",F32=\"\"),\"D\",\"no cd er\"))))","v":"N"},{"$f":"IF(G32=QCData!G32,\"S\",IF(AND(G32<>\"\",QCData!G32=\"\"),\"N\",IF(AND(G32<>\"\",QCData!G32<>\"\",G32<>QCData!G32),\"C\",IF(AND(QCData!G32<>\"\",G32=\"\"),\"D\",\"no cd er\"))))","v":"S"},{"$f":"IF(H32=QCData!H32,\"S\",IF(AND(H32<>\"\",QCData!H32=\"\"),\"N\",IF(AND(H32<>\"\",QCData!H32<>\"\",H32<>QCData!H32),\"C\",IF(AND(QCData!H32<>\"\",H32=\"\"),\"D\",\"no cd er\"))))","v":"S"},{"$f":"IF(I32=QCData!I32,\"S\",IF(AND(I32<>\"\",QCData!I32=\"\"),\"N\",IF(AND(I32<>\"\",QCData!I32<>\"\",I32<>QCData!I32),\"C\",IF(AND(QCData!I32<>\"\",I32=\"\"),\"D\",\"no cd er\"))))","v":"N"},{"$f":"IF(J32=QCData!J32,\"S\",IF(AND(J32<>\"\",QCData!J32=\"\"),\"N\",IF(AND(J32<>\"\",QCData!J32<>\"\",J32<>QCData!J32),\"C\",IF(AND(QCData!J32<>\"\",J32=\"\"),\"D\",\"no cd er\"))))","v":"N"},{"$f":"IF(K32=QCData!K32,\"S\",IF(AND(K32<>\"\",QCData!K32=\"\"),\"N\",IF(AND(K32<>\"\",QCData!K32<>\"\",K32<>QCData!K32),\"C\",IF(AND(QCData!K32<>\"\",K32=\"\"),\"D\",\"no cd er\"))))","v":"N"},{"$f":"IF(L32=QCData!L32,\"S\",IF(AND(L32<>\"\",QCData!L32=\"\"),\"N\",IF(AND(L32<>\"\",QCData!L32<>\"\",L32<>QCData!L32),\"C\",IF(AND(QCData!L32<>\"\",L32=\"\"),\"D\",\"no cd er\"))))","v":"N"},{"$f":"IF(M32=QCData!M32,\"S\",IF(AND(M32<>\"\",QCData!M32=\"\"),\"N\",IF(AND(M32<>\"\",QCData!M32<>\"\",M32<>QCData!M32),\"C\",IF(AND(QCData!M32<>\"\",M32=\"\"),\"D\",\"no cd er\"))))","v":"N"},{"$f":"IF(N32=QCData!N32,\"S\",IF(AND(N32<>\"\",QCData!N32=\"\"),\"N\",IF(AND(N32<>\"\",QCData!N32<>\"\",N32<>QCData!N32),\"C\",IF(AND(QCData!N32<>\"\",N32=\"\"),\"D\",\"no cd er\"))))","v":"N"},{"$f":"IF(O32=QCData!O32,\"S\",IF(AND(O32<>\"\",QCData!O32=\"\"),\"N\",IF(AND(O32<>\"\",QCData!O32<>\"\",O32<>QCData!O32),\"C\",IF(AND(QCData!O32<>\"\",O32=\"\"),\"D\",\"no cd er\"))))","v":"N"},{"$f":"IF(P32=QCData!P32,\"S\",IF(AND(P32<>\"\",QCData!P32=\"\"),\"N\",IF(AND(P32<>\"\",QCData!P32<>\"\",P32<>QCData!P32),\"C\",IF(AND(QCData!P32<>\"\",P32=\"\"),\"D\",\"no cd er\"))))","v":"N"},{"$f":"IF(Q32=QCData!Q32,\"S\",IF(AND(Q32<>\"\",QCData!Q32=\"\"),\"N\",IF(AND(Q32<>\"\",QCData!Q32<>\"\",Q32<>QCData!Q32),\"C\",IF(AND(QCData!Q32<>\"\",Q32=\"\"),\"D\",\"no cd er\"))))","v":"S"},{"$f":"IF(R32=QCData!R32,\"S\",IF(AND(R32<>\"\",QCData!R32=\"\"),\"N\",IF(AND(R32<>\"\",QCData!R32<>\"\",R32<>QCData!R32),\"C\",IF(AND(QCData!R32<>\"\",R32=\"\"),\"D\",\"no cd er\"))))","v":"S"},{"$f":"IF(S32=QCData!S32,\"S\",IF(AND(S32<>\"\",QCData!S32=\"\"),\"N\",IF(AND(S32<>\"\",QCData!S32<>\"\",S32<>QCData!S32),\"C\",IF(AND(QCData!S32<>\"\",S32=\"\"),\"D\",\"no cd er\"))))","v":"N"},{"$f":"IF(T32=QCData!T32,\"S\",IF(AND(T32<>\"\",QCData!T32=\"\"),\"N\",IF(AND(T32<>\"\",QCData!T32<>\"\",T32<>QCData!T32),\"C\",IF(AND(QCData!T32<>\"\",T32=\"\"),\"D\",\"no cd er\"))))","v":"N"},{"$f":"IF(U32=QCData!U32,\"S\",IF(AND(U32<>\"\",QCData!U32=\"\"),\"N\",IF(AND(U32<>\"\",QCData!U32<>\"\",U32<>QCData!U32),\"C\",IF(AND(QCData!U32<>\"\",U32=\"\"),\"D\",\"no cd er\"))))","v":"N"},{"$f":"IF(V32=QCData!V32,\"S\",IF(AND(V32<>\"\",QCData!V32=\"\"),\"N\",IF(AND(V32<>\"\",QCData!V32<>\"\",V32<>QCData!V32),\"C\",IF(AND(QCData!V32<>\"\",V32=\"\"),\"D\",\"no cd er\"))))","v":"N"},{"$f":"IF(W32=QCData!W32,\"S\",IF(AND(W32<>\"\",QCData!W32=\"\"),\"N\",IF(AND(W32<>\"\",QCData!W32<>\"\",W32<>QCData!W32),\"C\",IF(AND(QCData!W32<>\"\",W32=\"\"),\"D\",\"no cd er\"))))","v":"N"},{"$f":"IF(X32=QCData!X32,\"S\",IF(AND(X32<>\"\",QCData!X32=\"\"),\"N\",IF(AND(X32<>\"\",QCData!X32<>\"\",X32<>QCData!X32),\"C\",IF(AND(QCData!X32<>\"\",X32=\"\"),\"D\",\"no cd er\"))))","v":"N"},{"$f":"IF(Y32=QCData!Y32,\"S\",IF(AND(Y32<>\"\",QCData!Y32=\"\"),\"N\",IF(AND(Y32<>\"\",QCData!Y32<>\"\",Y32<>QCData!Y32),\"C\",IF(AND(QCData!Y32<>\"\",Y32=\"\"),\"D\",\"no cd er\"))))","v":"N"},{"$f":"IF(Z32=QCData!Z32,\"S\",IF(AND(Z32<>\"\",QCData!Z32=\"\"),\"N\",IF(AND(Z32<>\"\",QCData!Z32<>\"\",Z32<>QCData!Z32),\"C\",IF(AND(QCData!Z32<>\"\",Z32=\"\"),\"D\",\"no cd er\"))))","v":"N"}]
[4,"",0,1,4,"NO","","",100,92,84," ",55,42,36,14,"","",5.0999999999999996,5.4,93.1,94.1,95.1,"","","",null,null,null,null,null,null,null,null,null,null,null,null,null,null,null,null,null,null,null,null,null,null,null,null,null,null,4,null,0,1,4,"NO",null,null,100,92,84," ",55,42,36,14,null,null,5.0999999999999996,5.4,93.1,94.1,95.1,null,null,null,null,null,null,null,null,null,null,null,null,null,null,null,null,null,null,null,null,null,null,null,null,null,null,null,null,null,null,null,null,null,null,null,null,null,null,null,null,null,null,null,null,null,null,null,null,null,null,null,null,null,null,null,null,null,null,null,null,null,null,null,null,null,null,null,null,null,null,null,null,null,null,null,null,null,null,null,null,null,{"$f":"IF(A33=QCData!A33,\"S\",IF(AND(A33<>\"\",QCData!A33=\"\"),\"N\",IF(AND(A33<>\"\",QCData!A33<>\"\",A33<>QCData!A33),\"C\",IF(AND(QCData!A33<>\"\",A33=\"\"),\"D\",\"no cd er\"))))","v":"N"},{"$f":"IF(B33=QCData!B33,\"S\",IF(AND(B33<>\"\",QCData!B33=\"\"),\"N\",IF(AND(B33<>\"\",QCData!B33<>\"\",B33<>QCData!B33),\"C\",IF(AND(QCData!B33<>\"\",B33=\"\"),\"D\",\"no cd er\"))))","v":"S"},{"$f":"IF(C33=QCData!C33,\"S\",IF(AND(C33<>\"\",QCData!C33=\"\"),\"N\",IF(AND(C33<>\"\",QCData!C33<>\"\",C33<>QCData!C33),\"C\",IF(AND(QCData!C33<>\"\",C33=\"\"),\"D\",\"no cd er\"))))","v":"S"},{"$f":"IF(D33=QCData!D33,\"S\",IF(AND(D33<>\"\",QCData!D33=\"\"),\"N\",IF(AND(D33<>\"\",QCData!D33<>\"\",D33<>QCData!D33),\"C\",IF(AND(QCData!D33<>\"\",D33=\"\"),\"D\",\"no cd er\"))))","v":"N"},{"$f":"IF(E33=QCData!E33,\"S\",IF(AND(E33<>\"\",QCData!E33=\"\"),\"N\",IF(AND(E33<>\"\",QCData!E33<>\"\",E33<>QCData!E33),\"C\",IF(AND(QCData!E33<>\"\",E33=\"\"),\"D\",\"no cd er\"))))","v":"N"},{"$f":"IF(F33=QCData!F33,\"S\",IF(AND(F33<>\"\",QCData!F33=\"\"),\"N\",IF(AND(F33<>\"\",QCData!F33<>\"\",F33<>QCData!F33),\"C\",IF(AND(QCData!F33<>\"\",F33=\"\"),\"D\",\"no cd er\"))))","v":"N"},{"$f":"IF(G33=QCData!G33,\"S\",IF(AND(G33<>\"\",QCData!G33=\"\"),\"N\",IF(AND(G33<>\"\",QCData!G33<>\"\",G33<>QCData!G33),\"C\",IF(AND(QCData!G33<>\"\",G33=\"\"),\"D\",\"no cd er\"))))","v":"S"},{"$f":"IF(H33=QCData!H33,\"S\",IF(AND(H33<>\"\",QCData!H33=\"\"),\"N\",IF(AND(H33<>\"\",QCData!H33<>\"\",H33<>QCData!H33),\"C\",IF(AND(QCData!H33<>\"\",H33=\"\"),\"D\",\"no cd er\"))))","v":"S"},{"$f":"IF(I33=QCData!I33,\"S\",IF(AND(I33<>\"\",QCData!I33=\"\"),\"N\",IF(AND(I33<>\"\",QCData!I33<>\"\",I33<>QCData!I33),\"C\",IF(AND(QCData!I33<>\"\",I33=\"\"),\"D\",\"no cd er\"))))","v":"N"},{"$f":"IF(J33=QCData!J33,\"S\",IF(AND(J33<>\"\",QCData!J33=\"\"),\"N\",IF(AND(J33<>\"\",QCData!J33<>\"\",J33<>QCData!J33),\"C\",IF(AND(QCData!J33<>\"\",J33=\"\"),\"D\",\"no cd er\"))))","v":"N"},{"$f":"IF(K33=QCData!K33,\"S\",IF(AND(K33<>\"\",QCData!K33=\"\"),\"N\",IF(AND(K33<>\"\",QCData!K33<>\"\",K33<>QCData!K33),\"C\",IF(AND(QCData!K33<>\"\",K33=\"\"),\"D\",\"no cd er\"))))","v":"N"},{"$f":"IF(L33=QCData!L33,\"S\",IF(AND(L33<>\"\",QCData!L33=\"\"),\"N\",IF(AND(L33<>\"\",QCData!L33<>\"\",L33<>QCData!L33),\"C\",IF(AND(QCData!L33<>\"\",L33=\"\"),\"D\",\"no cd er\"))))","v":"N"},{"$f":"IF(M33=QCData!M33,\"S\",IF(AND(M33<>\"\",QCData!M33=\"\"),\"N\",IF(AND(M33<>\"\",QCData!M33<>\"\",M33<>QCData!M33),\"C\",IF(AND(QCData!M33<>\"\",M33=\"\"),\"D\",\"no cd er\"))))","v":"N"},{"$f":"IF(N33=QCData!N33,\"S\",IF(AND(N33<>\"\",QCData!N33=\"\"),\"N\",IF(AND(N33<>\"\",QCData!N33<>\"\",N33<>QCData!N33),\"C\",IF(AND(QCData!N33<>\"\",N33=\"\"),\"D\",\"no cd er\"))))","v":"N"},{"$f":"IF(O33=QCData!O33,\"S\",IF(AND(O33<>\"\",QCData!O33=\"\"),\"N\",IF(AND(O33<>\"\",QCData!O33<>\"\",O33<>QCData!O33),\"C\",IF(AND(QCData!O33<>\"\",O33=\"\"),\"D\",\"no cd er\"))))","v":"N"},{"$f":"IF(P33=QCData!P33,\"S\",IF(AND(P33<>\"\",QCData!P33=\"\"),\"N\",IF(AND(P33<>\"\",QCData!P33<>\"\",P33<>QCData!P33),\"C\",IF(AND(QCData!P33<>\"\",P33=\"\"),\"D\",\"no cd er\"))))","v":"N"},{"$f":"IF(Q33=QCData!Q33,\"S\",IF(AND(Q33<>\"\",QCData!Q33=\"\"),\"N\",IF(AND(Q33<>\"\",QCData!Q33<>\"\",Q33<>QCData!Q33),\"C\",IF(AND(QCData!Q33<>\"\",Q33=\"\"),\"D\",\"no cd er\"))))","v":"S"},{"$f":"IF(R33=QCData!R33,\"S\",IF(AND(R33<>\"\",QCData!R33=\"\"),\"N\",IF(AND(R33<>\"\",QCData!R33<>\"\",R33<>QCData!R33),\"C\",IF(AND(QCData!R33<>\"\",R33=\"\"),\"D\",\"no cd er\"))))","v":"S"},{"$f":"IF(S33=QCData!S33,\"S\",IF(AND(S33<>\"\",QCData!S33=\"\"),\"N\",IF(AND(S33<>\"\",QCData!S33<>\"\",S33<>QCData!S33),\"C\",IF(AND(QCData!S33<>\"\",S33=\"\"),\"D\",\"no cd er\"))))","v":"N"},{"$f":"IF(T33=QCData!T33,\"S\",IF(AND(T33<>\"\",QCData!T33=\"\"),\"N\",IF(AND(T33<>\"\",QCData!T33<>\"\",T33<>QCData!T33),\"C\",IF(AND(QCData!T33<>\"\",T33=\"\"),\"D\",\"no cd er\"))))","v":"N"},{"$f":"IF(U33=QCData!U33,\"S\",IF(AND(U33<>\"\",QCData!U33=\"\"),\"N\",IF(AND(U33<>\"\",QCData!U33<>\"\",U33<>QCData!U33),\"C\",IF(AND(QCData!U33<>\"\",U33=\"\"),\"D\",\"no cd er\"))))","v":"N"},{"$f":"IF(V33=QCData!V33,\"S\",IF(AND(V33<>\"\",QCData!V33=\"\"),\"N\",IF(AND(V33<>\"\",QCData!V33<>\"\",V33<>QCData!V33),\"C\",IF(AND(QCData!V33<>\"\",V33=\"\"),\"D\",\"no cd er\"))))","v":"N"},{"$f":"IF(W33=QCData!W33,\"S\",IF(AND(W33<>\"\",QCData!W33=\"\"),\"N\",IF(AND(W33<>\"\",QCData!W33<>\"\",W33<>QCData!W33),\"C\",IF(AND(QCData!W33<>\"\",W33=\"\"),\"D\",\"no cd er\"))))","v":"N"},{"$f":"IF(X33=QCData!X33,\"S\",IF(AND(X33<>\"\",QCData!X33=\"\"),\"N\",IF(AND(X33<>\"\",QCData!X33<>\"\",X33<>QCData!X33),\"C\",IF(AND(QCData!X33<>\"\",X33=\"\"),\"D\",\"no cd er\"))))","v":"S"},{"$f":"IF(Y33=QCData!Y33,\"S\",IF(AND(Y33<>\"\",QCData!Y33=\"\"),\"N\",IF(AND(Y33<>\"\",QCData!Y33<>\"\",Y33<>QCData!Y33),\"C\",IF(AND(QCData!Y33<>\"\",Y33=\"\"),\"D\",\"no cd er\"))))","v":"S"},{"$f":"IF(Z33=QCData!Z33,\"S\",IF(AND(Z33<>\"\",QCData!Z33=\"\"),\"N\",IF(AND(Z33<>\"\",QCData!Z33<>\"\",Z33<>QCData!Z33),\"C\",IF(AND(QCData!Z33<>\"\",Z33=\"\"),\"D\",\"no cd er\"))))","v":"S"}]
[5,"2008-11-12",0,1,5,"NO","","",100,91,85,69,51,35,22,15,"","",4.8,5.2,93.4,92.1,92.1,3.9,4,4.0999999999999996,null,null,null,null,null,null,null,null,null,null,null,null,null,null,null,null,null,null,null,null,null,null,null,null,null,null,5,39764,0,1,5,"NO",null,null,100,91,85,69,51,35,22,15,null,null,4.8,5.2,93.4,92.1,92.1,3.9,4,4.0999999999999996,null,null,null,null,null,null,null,null,null,null,null,null,null,null,null,null,null,null,null,null,null,null,null,null,null,null,null,null,null,null,null,null,null,null,null,null,null,null,null,null,null,null,null,null,null,null,null,null,null,null,null,null,null,null,null,null,null,null,null,null,null,null,null,null,null,null,null,null,null,null,null,null,null,null,null,null,null,null,{"$f":"IF(A34=QCData!A34,\"S\",IF(AND(A34<>\"\",QCData!A34=\"\"),\"N\",IF(AND(A34<>\"\",QCData!A34<>\"\",A34<>QCData!A34),\"C\",IF(AND(QCData!A34<>\"\",A34=\"\"),\"D\",\"no cd er\"))))","v":"N"},{"$f":"IF(B34=QCData!B34,\"S\",IF(AND(B34<>\"\",QCData!B34=\"\"),\"N\",IF(AND(B34<>\"\",QCData!B34<>\"\",B34<>QCData!B34),\"C\",IF(AND(QCData!B34<>\"\",B34=\"\"),\"D\",\"no cd er\"))))","v":"N"},{"$f":"IF(C34=QCData!C34,\"S\",IF(AND(C34<>\"\",QCData!C34=\"\"),\"N\",IF(AND(C34<>\"\",QCData!C34<>\"\",C34<>QCData!C34),\"C\",IF(AND(QCData!C34<>\"\",C34=\"\"),\"D\",\"no cd er\"))))","v":"S"},{"$f":"IF(D34=QCData!D34,\"S\",IF(AND(D34<>\"\",QCData!D34=\"\"),\"N\",IF(AND(D34<>\"\",QCData!D34<>\"\",D34<>QCData!D34),\"C\",IF(AND(QCData!D34<>\"\",D34=\"\"),\"D\",\"no cd er\"))))","v":"N"},{"$f":"IF(E34=QCData!E34,\"S\",IF(AND(E34<>\"\",QCData!E34=\"\"),\"N\",IF(AND(E34<>\"\",QCData!E34<>\"\",E34<>QCData!E34),\"C\",IF(AND(QCData!E34<>\"\",E34=\"\"),\"D\",\"no cd er\"))))","v":"N"},{"$f":"IF(F34=QCData!F34,\"S\",IF(AND(F34<>\"\",QCData!F34=\"\"),\"N\",IF(AND(F34<>\"\",QCData!F34<>\"\",F34<>QCData!F34),\"C\",IF(AND(QCData!F34<>\"\",F34=\"\"),\"D\",\"no cd er\"))))","v":"N"},{"$f":"IF(G34=QCData!G34,\"S\",IF(AND(G34<>\"\",QCData!G34=\"\"),\"N\",IF(AND(G34<>\"\",QCData!G34<>\"\",G34<>QCData!G34),\"C\",IF(AND(QCData!G34<>\"\",G34=\"\"),\"D\",\"no cd er\"))))","v":"S"},{"$f":"IF(H34=QCData!H34,\"S\",IF(AND(H34<>\"\",QCData!H34=\"\"),\"N\",IF(AND(H34<>\"\",QCData!H34<>\"\",H34<>QCData!H34),\"C\",IF(AND(QCData!H34<>\"\",H34=\"\"),\"D\",\"no cd er\"))))","v":"S"},{"$f":"IF(I34=QCData!I34,\"S\",IF(AND(I34<>\"\",QCData!I34=\"\"),\"N\",IF(AND(I34<>\"\",QCData!I34<>\"\",I34<>QCData!I34),\"C\",IF(AND(QCData!I34<>\"\",I34=\"\"),\"D\",\"no cd er\"))))","v":"N"},{"$f":"IF(J34=QCData!J34,\"S\",IF(AND(J34<>\"\",QCData!J34=\"\"),\"N\",IF(AND(J34<>\"\",QCData!J34<>\"\",J34<>QCData!J34),\"C\",IF(AND(QCData!J34<>\"\",J34=\"\"),\"D\",\"no cd er\"))))","v":"N"},{"$f":"IF(K34=QCData!K34,\"S\",IF(AND(K34<>\"\",QCData!K34=\"\"),\"N\",IF(AND(K34<>\"\",QCData!K34<>\"\",K34<>QCData!K34),\"C\",IF(AND(QCData!K34<>\"\",K34=\"\"),\"D\",\"no cd er\"))))","v":"N"},{"$f":"IF(L34=QCData!L34,\"S\",IF(AND(L34<>\"\",QCData!L34=\"\"),\"N\",IF(AND(L34<>\"\",QCData!L34<>\"\",L34<>QCData!L34),\"C\",IF(AND(QCData!L34<>\"\",L34=\"\"),\"D\",\"no cd er\"))))","v":"N"},{"$f":"IF(M34=QCData!M34,\"S\",IF(AND(M34<>\"\",QCData!M34=\"\"),\"N\",IF(AND(M34<>\"\",QCData!M34<>\"\",M34<>QCData!M34),\"C\",IF(AND(QCData!M34<>\"\",M34=\"\"),\"D\",\"no cd er\"))))","v":"N"},{"$f":"IF(N34=QCData!N34,\"S\",IF(AND(N34<>\"\",QCData!N34=\"\"),\"N\",IF(AND(N34<>\"\",QCData!N34<>\"\",N34<>QCData!N34),\"C\",IF(AND(QCData!N34<>\"\",N34=\"\"),\"D\",\"no cd er\"))))","v":"N"},{"$f":"IF(O34=QCData!O34,\"S\",IF(AND(O34<>\"\",QCData!O34=\"\"),\"N\",IF(AND(O34<>\"\",QCData!O34<>\"\",O34<>QCData!O34),\"C\",IF(AND(QCData!O34<>\"\",O34=\"\"),\"D\",\"no cd er\"))))","v":"N"},{"$f":"IF(P34=QCData!P34,\"S\",IF(AND(P34<>\"\",QCData!P34=\"\"),\"N\",IF(AND(P34<>\"\",QCData!P34<>\"\",P34<>QCData!P34),\"C\",IF(AND(QCData!P34<>\"\",P34=\"\"),\"D\",\"no cd er\"))))","v":"N"},{"$f":"IF(Q34=QCData!Q34,\"S\",IF(AND(Q34<>\"\",QCData!Q34=\"\"),\"N\",IF(AND(Q34<>\"\",QCData!Q34<>\"\",Q34<>QCData!Q34),\"C\",IF(AND(QCData!Q34<>\"\",Q34=\"\"),\"D\",\"no cd er\"))))","v":"S"},{"$f":"IF(R34=QCData!R34,\"S\",IF(AND(R34<>\"\",QCData!R34=\"\"),\"N\",IF(AND(R34<>\"\",QCData!R34<>\"\",R34<>QCData!R34),\"C\",IF(AND(QCData!R34<>\"\",R34=\"\"),\"D\",\"no cd er\"))))","v":"S"},{"$f":"IF(S34=QCData!S34,\"S\",IF(AND(S34<>\"\",QCData!S34=\"\"),\"N\",IF(AND(S34<>\"\",QCData!S34<>\"\",S34<>QCData!S34),\"C\",IF(AND(QCData!S34<>\"\",S34=\"\"),\"D\",\"no cd er\"))))","v":"N"},{"$f":"IF(T34=QCData!T34,\"S\",IF(AND(T34<>\"\",QCData!T34=\"\"),\"N\",IF(AND(T34<>\"\",QCData!T34<>\"\",T34<>QCData!T34),\"C\",IF(AND(QCData!T34<>\"\",T34=\"\"),\"D\",\"no cd er\"))))","v":"N"},{"$f":"IF(U34=QCData!U34,\"S\",IF(AND(U34<>\"\",QCData!U34=\"\"),\"N\",IF(AND(U34<>\"\",QCData!U34<>\"\",U34<>QCData!U34),\"C\",IF(AND(QCData!U34<>\"\",U34=\"\"),\"D\",\"no cd er\"))))","v":"N"},{"$f":"IF(V34=QCData!V34,\"S\",IF(AND(V34<>\"\",QCData!V34=\"\"),\"N\",IF(AND(V34<>\"\",QCData!V34<>\"\",V34<>QCData!V34),\"C\",IF(AND(QCData!V34<>\"\",V34=\"\"),\"D\",\"no cd er\"))))","v":"N"},{"$f":"IF(W34=QCData!W34,\"S\",IF(AND(W34<>\"\",QCData!W34=\"\"),\"N\",IF(AND(W34<>\"\",QCData!W34<>\"\",W34<>QCData!W34),\"C\",IF(AND(QCData!W34<>\"\",W34=\"\"),\"D\",\"no cd er\"))))","v":"N"},{"$f":"IF(X34=QCData!X34,\"S\",IF(AND(X34<>\"\",QCData!X34=\"\"),\"N\",IF(AND(X34<>\"\",QCData!X34<>\"\",X34<>QCData!X34),\"C\",IF(AND(QCData!X34<>\"\",X34=\"\"),\"D\",\"no cd er\"))))","v":"N"},{"$f":"IF(Y34=QCData!Y34,\"S\",IF(AND(Y34<>\"\",QCData!Y34=\"\"),\"N\",IF(AND(Y34<>\"\",QCData!Y34<>\"\",Y34<>QCData!Y34),\"C\",IF(AND(QCData!Y34<>\"\",Y34=\"\"),\"D\",\"no cd er\"))))","v":"N"},{"$f":"IF(Z34=QCData!Z34,\"S\",IF(AND(Z34<>\"\",QCData!Z34=\"\"),\"N\",IF(AND(Z34<>\"\",QCData!Z34<>\"\",Z34<>QCData!Z34),\"C\",IF(AND(QCData!Z34<>\"\",Z34=\"\"),\"D\",\"no cd er\"))))","v":"N"}]
[6,"2009-07-16",555,1,6,"NO","","",100,90,84,70,46,40,29,16,"","",6.8,5.09,93.4,92.1,92.1,"","","",null,null,null,null,null,null,null,null,null,null,null,null,null,null,null,null,null,null,null,null,null,null,null,null,null,null,6,40010,555,1,6,"NO",null,null,100,90,84,70,46,40,29,16,null,null,6.8,5.09,93.4,92.1,92.1,null,null,null,null,null,null,null,null,null,null,null,null,null,null,null,null,null,null,null,null,null,null,null,null,null,null,null,null,null,null,null,null,null,null,null,null,null,null,null,null,null,null,null,null,null,null,null,null,null,null,null,null,null,null,null,null,null,null,null,null,null,null,null,null,null,null,null,null,null,null,null,null,null,null,null,null,null,null,null,null,null,{"$f":"IF(A35=QCData!A35,\"S\",IF(AND(A35<>\"\",QCData!A35=\"\"),\"N\",IF(AND(A35<>\"\",QCData!A35<>\"\",A35<>QCData!A35),\"C\",IF(AND(QCData!A35<>\"\",A35=\"\"),\"D\",\"no cd er\"))))","v":"N"},{"$f":"IF(B35=QCData!B35,\"S\",IF(AND(B35<>\"\",QCData!B35=\"\"),\"N\",IF(AND(B35<>\"\",QCData!B35<>\"\",B35<>QCData!B35),\"C\",IF(AND(QCData!B35<>\"\",B35=\"\"),\"D\",\"no cd er\"))))","v":"N"},{"$f":"IF(C35=QCData!C35,\"S\",IF(AND(C35<>\"\",QCData!C35=\"\"),\"N\",IF(AND(C35<>\"\",QCData!C35<>\"\",C35<>QCData!C35),\"C\",IF(AND(QCData!C35<>\"\",C35=\"\"),\"D\",\"no cd er\"))))","v":"N"},{"$f":"IF(D35=QCData!D35,\"S\",IF(AND(D35<>\"\",QCData!D35=\"\"),\"N\",IF(AND(D35<>\"\",QCData!D35<>\"\",D35<>QCData!D35),\"C\",IF(AND(QCData!D35<>\"\",D35=\"\"),\"D\",\"no cd er\"))))","v":"N"},{"$f":"IF(E35=QCData!E35,\"S\",IF(AND(E35<>\"\",QCData!E35=\"\"),\"N\",IF(AND(E35<>\"\",QCData!E35<>\"\",E35<>QCData!E35),\"C\",IF(AND(QCData!E35<>\"\",E35=\"\"),\"D\",\"no cd er\"))))","v":"N"},{"$f":"IF(F35=QCData!F35,\"S\",IF(AND(F35<>\"\",QCData!F35=\"\"),\"N\",IF(AND(F35<>\"\",QCData!F35<>\"\",F35<>QCData!F35),\"C\",IF(AND(QCData!F35<>\"\",F35=\"\"),\"D\",\"no cd er\"))))","v":"N"},{"$f":"IF(G35=QCData!G35,\"S\",IF(AND(G35<>\"\",QCData!G35=\"\"),\"N\",IF(AND(G35<>\"\",QCData!G35<>\"\",G35<>QCData!G35),\"C\",IF(AND(QCData!G35<>\"\",G35=\"\"),\"D\",\"no cd er\"))))","v":"S"},{"$f":"IF(H35=QCData!H35,\"S\",IF(AND(H35<>\"\",QCData!H35=\"\"),\"N\",IF(AND(H35<>\"\",QCData!H35<>\"\",H35<>QCData!H35),\"C\",IF(AND(QCData!H35<>\"\",H35=\"\"),\"D\",\"no cd er\"))))","v":"S"},{"$f":"IF(I35=QCData!I35,\"S\",IF(AND(I35<>\"\",QCData!I35=\"\"),\"N\",IF(AND(I35<>\"\",QCData!I35<>\"\",I35<>QCData!I35),\"C\",IF(AND(QCData!I35<>\"\",I35=\"\"),\"D\",\"no cd er\"))))","v":"N"},{"$f":"IF(J35=QCData!J35,\"S\",IF(AND(J35<>\"\",QCData!J35=\"\"),\"N\",IF(AND(J35<>\"\",QCData!J35<>\"\",J35<>QCData!J35),\"C\",IF(AND(QCData!J35<>\"\",J35=\"\"),\"D\",\"no cd er\"))))","v":"N"},{"$f":"IF(K35=QCData!K35,\"S\",IF(AND(K35<>\"\",QCData!K35=\"\"),\"N\",IF(AND(K35<>\"\",QCData!K35<>\"\",K35<>QCData!K35),\"C\",IF(AND(QCData!K35<>\"\",K35=\"\"),\"D\",\"no cd er\"))))","v":"N"},{"$f":"IF(L35=QCData!L35,\"S\",IF(AND(L35<>\"\",QCData!L35=\"\"),\"N\",IF(AND(L35<>\"\",QCData!L35<>\"\",L35<>QCData!L35),\"C\",IF(AND(QCData!L35<>\"\",L35=\"\"),\"D\",\"no cd er\"))))","v":"N"},{"$f":"IF(M35=QCData!M35,\"S\",IF(AND(M35<>\"\",QCData!M35=\"\"),\"N\",IF(AND(M35<>\"\",QCData!M35<>\"\",M35<>QCData!M35),\"C\",IF(AND(QCData!M35<>\"\",M35=\"\"),\"D\",\"no cd er\"))))","v":"N"},{"$f":"IF(N35=QCData!N35,\"S\",IF(AND(N35<>\"\",QCData!N35=\"\"),\"N\",IF(AND(N35<>\"\",QCData!N35<>\"\",N35<>QCData!N35),\"C\",IF(AND(QCData!N35<>\"\",N35=\"\"),\"D\",\"no cd er\"))))","v":"N"},{"$f":"IF(O35=QCData!O35,\"S\",IF(AND(O35<>\"\",QCData!O35=\"\"),\"N\",IF(AND(O35<>\"\",QCData!O35<>\"\",O35<>QCData!O35),\"C\",IF(AND(QCData!O35<>\"\",O35=\"\"),\"D\",\"no cd er\"))))","v":"N"},{"$f":"IF(P35=QCData!P35,\"S\",IF(AND(P35<>\"\",QCData!P35=\"\"),\"N\",IF(AND(P35<>\"\",QCData!P35<>\"\",P35<>QCData!P35),\"C\",IF(AND(QCData!P35<>\"\",P35=\"\"),\"D\",\"no cd er\"))))","v":"N"},{"$f":"IF(Q35=QCData!Q35,\"S\",IF(AND(Q35<>\"\",QCData!Q35=\"\"),\"N\",IF(AND(Q35<>\"\",QCData!Q35<>\"\",Q35<>QCData!Q35),\"C\",IF(AND(QCData!Q35<>\"\",Q35=\"\"),\"D\",\"no cd er\"))))","v":"S"},{"$f":"IF(R35=QCData!R35,\"S\",IF(AND(R35<>\"\",QCData!R35=\"\"),\"N\",IF(AND(R35<>\"\",QCData!R35<>\"\",R35<>QCData!R35),\"C\",IF(AND(QCData!R35<>\"\",R35=\"\"),\"D\",\"no cd er\"))))","v":"S"},{"$f":"IF(S35=QCData!S35,\"S\",IF(AND(S35<>\"\",QCData!S35=\"\"),\"N\",IF(AND(S35<>\"\",QCData!S35<>\"\",S35<>QCData!S35),\"C\",IF(AND(QCData!S35<>\"\",S35=\"\"),\"D\",\"no cd er\"))))","v":"N"},{"$f":"IF(T35=QCData!T35,\"S\",IF(AND(T35<>\"\",QCData!T35=\"\"),\"N\",IF(AND(T35<>\"\",QCData!T35<>\"\",T35<>QCData!T35),\"C\",IF(AND(QCData!T35<>\"\",T35=\"\"),\"D\",\"no cd er\"))))","v":"N"},{"$f":"IF(U35=QCData!U35,\"S\",IF(AND(U35<>\"\",QCData!U35=\"\"),\"N\",IF(AND(U35<>\"\",QCData!U35<>\"\",U35<>QCData!U35),\"C\",IF(AND(QCData!U35<>\"\",U35=\"\"),\"D\",\"no cd er\"))))","v":"N"},{"$f":"IF(V35=QCData!V35,\"S\",IF(AND(V35<>\"\",QCData!V35=\"\"),\"N\",IF(AND(V35<>\"\",QCData!V35<>\"\",V35<>QCData!V35),\"C\",IF(AND(QCData!V35<>\"\",V35=\"\"),\"D\",\"no cd er\"))))","v":"N"},{"$f":"IF(W35=QCData!W35,\"S\",IF(AND(W35<>\"\",QCData!W35=\"\"),\"N\",IF(AND(W35<>\"\",QCData!W35<>\"\",W35<>QCData!W35),\"C\",IF(AND(QCData!W35<>\"\",W35=\"\"),\"D\",\"no cd er\"))))","v":"N"},{"$f":"IF(X35=QCData!X35,\"S\",IF(AND(X35<>\"\",QCData!X35=\"\"),\"N\",IF(AND(X35<>\"\",QCData!X35<>\"\",X35<>QCData!X35),\"C\",IF(AND(QCData!X35<>\"\",X35=\"\"),\"D\",\"no cd er\"))))","v":"S"},{"$f":"IF(Y35=QCData!Y35,\"S\",IF(AND(Y35<>\"\",QCData!Y35=\"\"),\"N\",IF(AND(Y35<>\"\",QCData!Y35<>\"\",Y35<>QCData!Y35),\"C\",IF(AND(QCData!Y35<>\"\",Y35=\"\"),\"D\",\"no cd er\"))))","v":"S"},{"$f":"IF(Z35=QCData!Z35,\"S\",IF(AND(Z35<>\"\",QCData!Z35=\"\"),\"N\",IF(AND(Z35<>\"\",QCData!Z35<>\"\",Z35<>QCData!Z35),\"C\",IF(AND(QCData!Z35<>\"\",Z35=\"\"),\"D\",\"no cd er\"))))","v":"S"}]
[7,"",0,1,7,"NO","","",100,91,84,71,46,40,23,17,"","",5.8,5.04,92,95,96,3.5,1,3.6,null,null,null,null,null,null,null,null,null,null,null,null,null,null,null,null,null,null,null,null,null,null,null,null,null,null,7,null,0,1,7,"NO",null,null,100,91,84,71,46,40,23,17,null,null,5.8,5.04,92,95,96,3.5,1,3.6,null,null,null,null,null,null,null,null,null,null,null,null,null,null,null,null,null,null,null,null,null,null,null,null,null,null,null,null,null,null,null,null,null,null,null,null,null,null,null,null,null,null,null,null,null,null,null,null,null,null,null,null,null,null,null,null,null,null,null,null,null,null,null,null,null,null,null,null,null,null,null,null,null,null,null,null,null,null,{"$f":"IF(A36=QCData!A36,\"S\",IF(AND(A36<>\"\",QCData!A36=\"\"),\"N\",IF(AND(A36<>\"\",QCData!A36<>\"\",A36<>QCData!A36),\"C\",IF(AND(QCData!A36<>\"\",A36=\"\"),\"D\",\"no cd er\"))))","v":"N"},{"$f":"IF(B36=QCData!B36,\"S\",IF(AND(B36<>\"\",QCData!B36=\"\"),\"N\",IF(AND(B36<>\"\",QCData!B36<>\"\",B36<>QCData!B36),\"C\",IF(AND(QCData!B36<>\"\",B36=\"\"),\"D\",\"no cd er\"))))","v":"S"},{"$f":"IF(C36=QCData!C36,\"S\",IF(AND(C36<>\"\",QCData!C36=\"\"),\"N\",IF(AND(C36<>\"\",QCData!C36<>\"\",C36<>QCData!C36),\"C\",IF(AND(QCData!C36<>\"\",C36=\"\"),\"D\",\"no cd er\"))))","v":"S"},{"$f":"IF(D36=QCData!D36,\"S\",IF(AND(D36<>\"\",QCData!D36=\"\"),\"N\",IF(AND(D36<>\"\",QCData!D36<>\"\",D36<>QCData!D36),\"C\",IF(AND(QCData!D36<>\"\",D36=\"\"),\"D\",\"no cd er\"))))","v":"N"},{"$f":"IF(E36=QCData!E36,\"S\",IF(AND(E36<>\"\",QCData!E36=\"\"),\"N\",IF(AND(E36<>\"\",QCData!E36<>\"\",E36<>QCData!E36),\"C\",IF(AND(QCData!E36<>\"\",E36=\"\"),\"D\",\"no cd er\"))))","v":"N"},{"$f":"IF(F36=QCData!F36,\"S\",IF(AND(F36<>\"\",QCData!F36=\"\"),\"N\",IF(AND(F36<>\"\",QCData!F36<>\"\",F36<>QCData!F36),\"C\",IF(AND(QCData!F36<>\"\",F36=\"\"),\"D\",\"no cd er\"))))","v":"N"},{"$f":"IF(G36=QCData!G36,\"S\",IF(AND(G36<>\"\",QCData!G36=\"\"),\"N\",IF(AND(G36<>\"\",QCData!G36<>\"\",G36<>QCData!G36),\"C\",IF(AND(QCData!G36<>\"\",G36=\"\"),\"D\",\"no cd er\"))))","v":"S"},{"$f":"IF(H36=QCData!H36,\"S\",IF(AND(H36<>\"\",QCData!H36=\"\"),\"N\",IF(AND(H36<>\"\",QCData!H36<>\"\",H36<>QCData!H36),\"C\",IF(AND(QCData!H36<>\"\",H36=\"\"),\"D\",\"no cd er\"))))","v":"S"},{"$f":"IF(I36=QCData!I36,\"S\",IF(AND(I36<>\"\",QCData!I36=\"\"),\"N\",IF(AND(I36<>\"\",QCData!I36<>\"\",I36<>QCData!I36),\"C\",IF(AND(QCData!I36<>\"\",I36=\"\"),\"D\",\"no cd er\"))))","v":"N"},{"$f":"IF(J36=QCData!J36,\"S\",IF(AND(J36<>\"\",QCData!J36=\"\"),\"N\",IF(AND(J36<>\"\",QCData!J36<>\"\",J36<>QCData!J36),\"C\",IF(AND(QCData!J36<>\"\",J36=\"\"),\"D\",\"no cd er\"))))","v":"N"},{"$f":"IF(K36=QCData!K36,\"S\",IF(AND(K36<>\"\",QCData!K36=\"\"),\"N\",IF(AND(K36<>\"\",QCData!K36<>\"\",K36<>QCData!K36),\"C\",IF(AND(QCData!K36<>\"\",K36=\"\"),\"D\",\"no cd er\"))))","v":"N"},{"$f":"IF(L36=QCData!L36,\"S\",IF(AND(L36<>\"\",QCData!L36=\"\"),\"N\",IF(AND(L36<>\"\",QCData!L36<>\"\",L36<>QCData!L36),\"C\",IF(AND(QCData!L36<>\"\",L36=\"\"),\"D\",\"no cd er\"))))","v":"N"},{"$f":"IF(M36=QCData!M36,\"S\",IF(AND(M36<>\"\",QCData!M36=\"\"),\"N\",IF(AND(M36<>\"\",QCData!M36<>\"\",M36<>QCData!M36),\"C\",IF(AND(QCData!M36<>\"\",M36=\"\"),\"D\",\"no cd er\"))))","v":"N"},{"$f":"IF(N36=QCData!N36,\"S\",IF(AND(N36<>\"\",QCData!N36=\"\"),\"N\",IF(AND(N36<>\"\",QCData!N36<>\"\",N36<>QCData!N36),\"C\",IF(AND(QCData!N36<>\"\",N36=\"\"),\"D\",\"no cd er\"))))","v":"N"},{"$f":"IF(O36=QCData!O36,\"S\",IF(AND(O36<>\"\",QCData!O36=\"\"),\"N\",IF(AND(O36<>\"\",QCData!O36<>\"\",O36<>QCData!O36),\"C\",IF(AND(QCData!O36<>\"\",O36=\"\"),\"D\",\"no cd er\"))))","v":"N"},{"$f":"IF(P36=QCData!P36,\"S\",IF(AND(P36<>\"\",QCData!P36=\"\"),\"N\",IF(AND(P36<>\"\",QCData!P36<>\"\",P36<>QCData!P36),\"C\",IF(AND(QCData!P36<>\"\",P36=\"\"),\"D\",\"no cd er\"))))","v":"N"},{"$f":"IF(Q36=QCData!Q36,\"S\",IF(AND(Q36<>\"\",QCData!Q36=\"\"),\"N\",IF(AND(Q36<>\"\",QCData!Q36<>\"\",Q36<>QCData!Q36),\"C\",IF(AND(QCData!Q36<>\"\",Q36=\"\"),\"D\",\"no cd er\"))))","v":"S"},{"$f":"IF(R36=QCData!R36,\"S\",IF(AND(R36<>\"\",QCData!R36=\"\"),\"N\",IF(AND(R36<>\"\",QCData!R36<>\"\",R36<>QCData!R36),\"C\",IF(AND(QCData!R36<>\"\",R36=\"\"),\"D\",\"no cd er\"))))","v":"S"},{"$f":"IF(S36=QCData!S36,\"S\",IF(AND(S36<>\"\",QCData!S36=\"\"),\"N\",IF(AND(S36<>\"\",QCData!S36<>\"\",S36<>QCData!S36),\"C\",IF(AND(QCData!S36<>\"\",S36=\"\"),\"D\",\"no cd er\"))))","v":"N"},{"$f":"IF(T36=QCData!T36,\"S\",IF(AND(T36<>\"\",QCData!T36=\"\"),\"N\",IF(AND(T36<>\"\",QCData!T36<>\"\",T36<>QCData!T36),\"C\",IF(AND(QCData!T36<>\"\",T36=\"\"),\"D\",\"no cd er\"))))","v":"N"},{"$f":"IF(U36=QCData!U36,\"S\",IF(AND(U36<>\"\",QCData!U36=\"\"),\"N\",IF(AND(U36<>\"\",QCData!U36<>\"\",U36<>QCData!U36),\"C\",IF(AND(QCData!U36<>\"\",U36=\"\"),\"D\",\"no cd er\"))))","v":"N"},{"$f":"IF(V36=QCData!V36,\"S\",IF(AND(V36<>\"\",QCData!V36=\"\"),\"N\",IF(AND(V36<>\"\",QCData!V36<>\"\",V36<>QCData!V36),\"C\",IF(AND(QCData!V36<>\"\",V36=\"\"),\"D\",\"no cd er\"))))","v":"N"},{"$f":"IF(W36=QCData!W36,\"S\",IF(AND(W36<>\"\",QCData!W36=\"\"),\"N\",IF(AND(W36<>\"\",QCData!W36<>\"\",W36<>QCData!W36),\"C\",IF(AND(QCData!W36<>\"\",W36=\"\"),\"D\",\"no cd er\"))))","v":"N"},{"$f":"IF(X36=QCData!X36,\"S\",IF(AND(X36<>\"\",QCData!X36=\"\"),\"N\",IF(AND(X36<>\"\",QCData!X36<>\"\",X36<>QCData!X36),\"C\",IF(AND(QCData!X36<>\"\",X36=\"\"),\"D\",\"no cd er\"))))","v":"N"},{"$f":"IF(Y36=QCData!Y36,\"S\",IF(AND(Y36<>\"\",QCData!Y36=\"\"),\"N\",IF(AND(Y36<>\"\",QCData!Y36<>\"\",Y36<>QCData!Y36),\"C\",IF(AND(QCData!Y36<>\"\",Y36=\"\"),\"D\",\"no cd er\"))))","v":"N"},{"$f":"IF(Z36=QCData!Z36,\"S\",IF(AND(Z36<>\"\",QCData!Z36=\"\"),\"N\",IF(AND(Z36<>\"\",QCData!Z36<>\"\",Z36<>QCData!Z36),\"C\",IF(AND(QCData!Z36<>\"\",Z36=\"\"),\"D\",\"no cd er\"))))","v":"N"}]
[8,"",0,1,8,"NO","","",100,90,86,63,38,40,35,18,"","",4.9000000000000004,4.9800000000000004,93.1,94.1,95.1,"","","",null,null,null,null,null,null,null,null,null,null,null,null,null,null,null,null,null,null,null,null,null,null,null,null,null,null,8,null,0,1,8,"NO",null,null,100,90,86,63,38,40,35,18,null,null,4.9000000000000004,4.9800000000000004,93.1,94.1,95.1,null,null,null,null,null,null,null,null,null,null,null,null,null,null,null,null,null,null,null,null,null,null,null,null,null,null,null,null,null,null,null,null,null,null,null,null,null,null,null,null,null,null,null,null,null,null,null,null,null,null,null,null,null,null,null,null,null,null,null,null,null,null,null,null,null,null,null,null,null,null,null,null,null,null,null,null,null,null,null,null,null,{"$f":"IF(A37=QCData!A37,\"S\",IF(AND(A37<>\"\",QCData!A37=\"\"),\"N\",IF(AND(A37<>\"\",QCData!A37<>\"\",A37<>QCData!A37),\"C\",IF(AND(QCData!A37<>\"\",A37=\"\"),\"D\",\"no cd er\"))))","v":"N"},{"$f":"IF(B37=QCData!B37,\"S\",IF(AND(B37<>\"\",QCData!B37=\"\"),\"N\",IF(AND(B37<>\"\",QCData!B37<>\"\",B37<>QCData!B37),\"C\",IF(AND(QCData!B37<>\"\",B37=\"\"),\"D\",\"no cd er\"))))","v":"S"},{"$f":"IF(C37=QCData!C37,\"S\",IF(AND(C37<>\"\",QCData!C37=\"\"),\"N\",IF(AND(C37<>\"\",QCData!C37<>\"\",C37<>QCData!C37),\"C\",IF(AND(QCData!C37<>\"\",C37=\"\"),\"D\",\"no cd er\"))))","v":"S"},{"$f":"IF(D37=QCData!D37,\"S\",IF(AND(D37<>\"\",QCData!D37=\"\"),\"N\",IF(AND(D37<>\"\",QCData!D37<>\"\",D37<>QCData!D37),\"C\",IF(AND(QCData!D37<>\"\",D37=\"\"),\"D\",\"no cd er\"))))","v":"N"},{"$f":"IF(E37=QCData!E37,\"S\",IF(AND(E37<>\"\",QCData!E37=\"\"),\"N\",IF(AND(E37<>\"\",QCData!E37<>\"\",E37<>QCData!E37),\"C\",IF(AND(QCData!E37<>\"\",E37=\"\"),\"D\",\"no cd er\"))))","v":"N"},{"$f":"IF(F37=QCData!F37,\"S\",IF(AND(F37<>\"\",QCData!F37=\"\"),\"N\",IF(AND(F37<>\"\",QCData!F37<>\"\",F37<>QCData!F37),\"C\",IF(AND(QCData!F37<>\"\",F37=\"\"),\"D\",\"no cd er\"))))","v":"N"},{"$f":"IF(G37=QCData!G37,\"S\",IF(AND(G37<>\"\",QCData!G37=\"\"),\"N\",IF(AND(G37<>\"\",QCData!G37<>\"\",G37<>QCData!G37),\"C\",IF(AND(QCData!G37<>\"\",G37=\"\"),\"D\",\"no cd er\"))))","v":"S"},{"$f":"IF(H37=QCData!H37,\"S\",IF(AND(H37<>\"\",QCData!H37=\"\"),\"N\",IF(AND(H37<>\"\",QCData!H37<>\"\",H37<>QCData!H37),\"C\",IF(AND(QCData!H37<>\"\",H37=\"\"),\"D\",\"no cd er\"))))","v":"S"},{"$f":"IF(I37=QCData!I37,\"S\",IF(AND(I37<>\"\",QCData!I37=\"\"),\"N\",IF(AND(I37<>\"\",QCData!I37<>\"\",I37<>QCData!I37),\"C\",IF(AND(QCData!I37<>\"\",I37=\"\"),\"D\",\"no cd er\"))))","v":"N"},{"$f":"IF(J37=QCData!J37,\"S\",IF(AND(J37<>\"\",QCData!J37=\"\"),\"N\",IF(AND(J37<>\"\",QCData!J37<>\"\",J37<>QCData!J37),\"C\",IF(AND(QCData!J37<>\"\",J37=\"\"),\"D\",\"no cd er\"))))","v":"N"},{"$f":"IF(K37=QCData!K37,\"S\",IF(AND(K37<>\"\",QCData!K37=\"\"),\"N\",IF(AND(K37<>\"\",QCData!K37<>\"\",K37<>QCData!K37),\"C\",IF(AND(QCData!K37<>\"\",K37=\"\"),\"D\",\"no cd er\"))))","v":"N"},{"$f":"IF(L37=QCData!L37,\"S\",IF(AND(L37<>\"\",QCData!L37=\"\"),\"N\",IF(AND(L37<>\"\",QCData!L37<>\"\",L37<>QCData!L37),\"C\",IF(AND(QCData!L37<>\"\",L37=\"\"),\"D\",\"no cd er\"))))","v":"N"},{"$f":"IF(M37=QCData!M37,\"S\",IF(AND(M37<>\"\",QCData!M37=\"\"),\"N\",IF(AND(M37<>\"\",QCData!M37<>\"\",M37<>QCData!M37),\"C\",IF(AND(QCData!M37<>\"\",M37=\"\"),\"D\",\"no cd er\"))))","v":"N"},{"$f":"IF(N37=QCData!N37,\"S\",IF(AND(N37<>\"\",QCData!N37=\"\"),\"N\",IF(AND(N37<>\"\",QCData!N37<>\"\",N37<>QCData!N37),\"C\",IF(AND(QCData!N37<>\"\",N37=\"\"),\"D\",\"no cd er\"))))","v":"N"},{"$f":"IF(O37=QCData!O37,\"S\",IF(AND(O37<>\"\",QCData!O37=\"\"),\"N\",IF(AND(O37<>\"\",QCData!O37<>\"\",O37<>QCData!O37),\"C\",IF(AND(QCData!O37<>\"\",O37=\"\"),\"D\",\"no cd er\"))))","v":"N"},{"$f":"IF(P37=QCData!P37,\"S\",IF(AND(P37<>\"\",QCData!P37=\"\"),\"N\",IF(AND(P37<>\"\",QCData!P37<>\"\",P37<>QCData!P37),\"C\",IF(AND(QCData!P37<>\"\",P37=\"\"),\"D\",\"no cd er\"))))","v":"N"},{"$f":"IF(Q37=QCData!Q37,\"S\",IF(AND(Q37<>\"\",QCData!Q37=\"\"),\"N\",IF(AND(Q37<>\"\",QCData!Q37<>\"\",Q37<>QCData!Q37),\"C\",IF(AND(QCData!Q37<>\"\",Q37=\"\"),\"D\",\"no cd er\"))))","v":"S"},{"$f":"IF(R37=QCData!R37,\"S\",IF(AND(R37<>\"\",QCData!R37=\"\"),\"N\",IF(AND(R37<>\"\",QCData!R37<>\"\",R37<>QCData!R37),\"C\",IF(AND(QCData!R37<>\"\",R37=\"\"),\"D\",\"no cd er\"))))","v":"S"},{"$f":"IF(S37=QCData!S37,\"S\",IF(AND(S37<>\"\",QCData!S37=\"\"),\"N\",IF(AND(S37<>\"\",QCData!S37<>\"\",S37<>QCData!S37),\"C\",IF(AND(QCData!S37<>\"\",S37=\"\"),\"D\",\"no cd er\"))))","v":"N"},{"$f":"IF(T37=QCData!T37,\"S\",IF(AND(T37<>\"\",QCData!T37=\"\"),\"N\",IF(AND(T37<>\"\",QCData!T37<>\"\",T37<>QCData!T37),\"C\",IF(AND(QCData!T37<>\"\",T37=\"\"),\"D\",\"no cd er\"))))","v":"N"},{"$f":"IF(U37=QCData!U37,\"S\",IF(AND(U37<>\"\",QCData!U37=\"\"),\"N\",IF(AND(U37<>\"\",QCData!U37<>\"\",U37<>QCData!U37),\"C\",IF(AND(QCData!U37<>\"\",U37=\"\"),\"D\",\"no cd er\"))))","v":"N"},{"$f":"IF(V37=QCData!V37,\"S\",IF(AND(V37<>\"\",QCData!V37=\"\"),\"N\",IF(AND(V37<>\"\",QCData!V37<>\"\",V37<>QCData!V37),\"C\",IF(AND(QCData!V37<>\"\",V37=\"\"),\"D\",\"no cd er\"))))","v":"N"},{"$f":"IF(W37=QCData!W37,\"S\",IF(AND(W37<>\"\",QCData!W37=\"\"),\"N\",IF(AND(W37<>\"\",QCData!W37<>\"\",W37<>QCData!W37),\"C\",IF(AND(QCData!W37<>\"\",W37=\"\"),\"D\",\"no cd er\"))))","v":"N"},{"$f":"IF(X37=QCData!X37,\"S\",IF(AND(X37<>\"\",QCData!X37=\"\"),\"N\",IF(AND(X37<>\"\",QCData!X37<>\"\",X37<>QCData!X37),\"C\",IF(AND(QCData!X37<>\"\",X37=\"\"),\"D\",\"no cd er\"))))","v":"S"},{"$f":"IF(Y37=QCData!Y37,\"S\",IF(AND(Y37<>\"\",QCData!Y37=\"\"),\"N\",IF(AND(Y37<>\"\",QCData!Y37<>\"\",Y37<>QCData!Y37),\"C\",IF(AND(QCData!Y37<>\"\",Y37=\"\"),\"D\",\"no cd er\"))))","v":"S"},{"$f":"IF(Z37=QCData!Z37,\"S\",IF(AND(Z37<>\"\",QCData!Z37=\"\"),\"N\",IF(AND(Z37<>\"\",QCData!Z37<>\"\",Z37<>QCData!Z37),\"C\",IF(AND(QCData!Z37<>\"\",Z37=\"\"),\"D\",\"no cd er\"))))","v":"S"}]
[9,"2009-07-17",0,1,9,"NO","","",100,91,84,80,43,40,36,19,"","",7,5.0999999999999996,93.4,92.1,92.1,4,4,4,null,null,null,null,null,null,null,null,null,null,null,null,null,null,null,null,null,null,null,null,null,null,null,null,null,null,9,40011,0,1,9,"NO",null,null,100,91,84,80,43,40,36,19,null,null,7,5.0999999999999996,93.4,92.1,92.1,4,4,4,null,null,null,null,null,null,null,null,null,null,null,null,null,null,null,null,null,null,null,null,null,null,null,null,null,null,null,null,null,null,null,null,null,null,null,null,null,null,null,null,null,null,null,null,null,null,null,null,null,null,null,null,null,null,null,null,null,null,null,null,null,null,null,null,null,null,null,null,null,null,null,null,null,null,null,null,null,null,{"$f":"IF(A38=QCData!A38,\"S\",IF(AND(A38<>\"\",QCData!A38=\"\"),\"N\",IF(AND(A38<>\"\",QCData!A38<>\"\",A38<>QCData!A38),\"C\",IF(AND(QCData!A38<>\"\",A38=\"\"),\"D\",\"no cd er\"))))","v":"N"},{"$f":"IF(B38=QCData!B38,\"S\",IF(AND(B38<>\"\",QCData!B38=\"\"),\"N\",IF(AND(B38<>\"\",QCData!B38<>\"\",B38<>QCData!B38),\"C\",IF(AND(QCData!B38<>\"\",B38=\"\"),\"D\",\"no cd er\"))))","v":"N"},{"$f":"IF(C38=QCData!C38,\"S\",IF(AND(C38<>\"\",QCData!C38=\"\"),\"N\",IF(AND(C38<>\"\",QCData!C38<>\"\",C38<>QCData!C38),\"C\",IF(AND(QCData!C38<>\"\",C38=\"\"),\"D\",\"no cd er\"))))","v":"S"},{"$f":"IF(D38=QCData!D38,\"S\",IF(AND(D38<>\"\",QCData!D38=\"\"),\"N\",IF(AND(D38<>\"\",QCData!D38<>\"\",D38<>QCData!D38),\"C\",IF(AND(QCData!D38<>\"\",D38=\"\"),\"D\",\"no cd er\"))))","v":"N"},{"$f":"IF(E38=QCData!E38,\"S\",IF(AND(E38<>\"\",QCData!E38=\"\"),\"N\",IF(AND(E38<>\"\",QCData!E38<>\"\",E38<>QCData!E38),\"C\",IF(AND(QCData!E38<>\"\",E38=\"\"),\"D\",\"no cd er\"))))","v":"N"},{"$f":"IF(F38=QCData!F38,\"S\",IF(AND(F38<>\"\",QCData!F38=\"\"),\"N\",IF(AND(F38<>\"\",QCData!F38<>\"\",F38<>QCData!F38),\"C\",IF(AND(QCData!F38<>\"\",F38=\"\"),\"D\",\"no cd er\"))))","v":"N"},{"$f":"IF(G38=QCData!G38,\"S\",IF(AND(G38<>\"\",QCData!G38=\"\"),\"N\",IF(AND(G38<>\"\",QCData!G38<>\"\",G38<>QCData!G38),\"C\",IF(AND(QCData!G38<>\"\",G38=\"\"),\"D\",\"no cd er\"))))","v":"S"},{"$f":"IF(H38=QCData!H38,\"S\",IF(AND(H38<>\"\",QCData!H38=\"\"),\"N\",IF(AND(H38<>\"\",QCData!H38<>\"\",H38<>QCData!H38),\"C\",IF(AND(QCData!H38<>\"\",H38=\"\"),\"D\",\"no cd er\"))))","v":"S"},{"$f":"IF(I38=QCData!I38,\"S\",IF(AND(I38<>\"\",QCData!I38=\"\"),\"N\",IF(AND(I38<>\"\",QCData!I38<>\"\",I38<>QCData!I38),\"C\",IF(AND(QCData!I38<>\"\",I38=\"\"),\"D\",\"no cd er\"))))","v":"N"},{"$f":"IF(J38=QCData!J38,\"S\",IF(AND(J38<>\"\",QCData!J38=\"\"),\"N\",IF(AND(J38<>\"\",QCData!J38<>\"\",J38<>QCData!J38),\"C\",IF(AND(QCData!J38<>\"\",J38=\"\"),\"D\",\"no cd er\"))))","v":"N"},{"$f":"IF(K38=QCData!K38,\"S\",IF(AND(K38<>\"\",QCData!K38=\"\"),\"N\",IF(AND(K38<>\"\",QCData!K38<>\"\",K38<>QCData!K38),\"C\",IF(AND(QCData!K38<>\"\",K38=\"\"),\"D\",\"no cd er\"))))","v":"N"},{"$f":"IF(L38=QCData!L38,\"S\",IF(AND(L38<>\"\",QCData!L38=\"\"),\"N\",IF(AND(L38<>\"\",QCData!L38<>\"\",L38<>QCData!L38),\"C\",IF(AND(QCData!L38<>\"\",L38=\"\"),\"D\",\"no cd er\"))))","v":"N"},{"$f":"IF(M38=QCData!M38,\"S\",IF(AND(M38<>\"\",QCData!M38=\"\"),\"N\",IF(AND(M38<>\"\",QCData!M38<>\"\",M38<>QCData!M38),\"C\",IF(AND(QCData!M38<>\"\",M38=\"\"),\"D\",\"no cd er\"))))","v":"N"},{"$f":"IF(N38=QCData!N38,\"S\",IF(AND(N38<>\"\",QCData!N38=\"\"),\"N\",IF(AND(N38<>\"\",QCData!N38<>\"\",N38<>QCData!N38),\"C\",IF(AND(QCData!N38<>\"\",N38=\"\"),\"D\",\"no cd er\"))))","v":"N"},{"$f":"IF(O38=QCData!O38,\"S\",IF(AND(O38<>\"\",QCData!O38=\"\"),\"N\",IF(AND(O38<>\"\",QCData!O38<>\"\",O38<>QCData!O38),\"C\",IF(AND(QCData!O38<>\"\",O38=\"\"),\"D\",\"no cd er\"))))","v":"N"},{"$f":"IF(P38=QCData!P38,\"S\",IF(AND(P38<>\"\",QCData!P38=\"\"),\"N\",IF(AND(P38<>\"\",QCData!P38<>\"\",P38<>QCData!P38),\"C\",IF(AND(QCData!P38<>\"\",P38=\"\"),\"D\",\"no cd er\"))))","v":"N"},{"$f":"IF(Q38=QCData!Q38,\"S\",IF(AND(Q38<>\"\",QCData!Q38=\"\"),\"N\",IF(AND(Q38<>\"\",QCData!Q38<>\"\",Q38<>QCData!Q38),\"C\",IF(AND(QCData!Q38<>\"\",Q38=\"\"),\"D\",\"no cd er\"))))","v":"S"},{"$f":"IF(R38=QCData!R38,\"S\",IF(AND(R38<>\"\",QCData!R38=\"\"),\"N\",IF(AND(R38<>\"\",QCData!R38<>\"\",R38<>QCData!R38),\"C\",IF(AND(QCData!R38<>\"\",R38=\"\"),\"D\",\"no cd er\"))))","v":"S"},{"$f":"IF(S38=QCData!S38,\"S\",IF(AND(S38<>\"\",QCData!S38=\"\"),\"N\",IF(AND(S38<>\"\",QCData!S38<>\"\",S38<>QCData!S38),\"C\",IF(AND(QCData!S38<>\"\",S38=\"\"),\"D\",\"no cd er\"))))","v":"N"},{"$f":"IF(T38=QCData!T38,\"S\",IF(AND(T38<>\"\",QCData!T38=\"\"),\"N\",IF(AND(T38<>\"\",QCData!T38<>\"\",T38<>QCData!T38),\"C\",IF(AND(QCData!T38<>\"\",T38=\"\"),\"D\",\"no cd er\"))))","v":"N"},{"$f":"IF(U38=QCData!U38,\"S\",IF(AND(U38<>\"\",QCData!U38=\"\"),\"N\",IF(AND(U38<>\"\",QCData!U38<>\"\",U38<>QCData!U38),\"C\",IF(AND(QCData!U38<>\"\",U38=\"\"),\"D\",\"no cd er\"))))","v":"N"},{"$f":"IF(V38=QCData!V38,\"S\",IF(AND(V38<>\"\",QCData!V38=\"\"),\"N\",IF(AND(V38<>\"\",QCData!V38<>\"\",V38<>QCData!V38),\"C\",IF(AND(QCData!V38<>\"\",V38=\"\"),\"D\",\"no cd er\"))))","v":"N"},{"$f":"IF(W38=QCData!W38,\"S\",IF(AND(W38<>\"\",QCData!W38=\"\"),\"N\",IF(AND(W38<>\"\",QCData!W38<>\"\",W38<>QCData!W38),\"C\",IF(AND(QCData!W38<>\"\",W38=\"\"),\"D\",\"no cd er\"))))","v":"N"},{"$f":"IF(X38=QCData!X38,\"S\",IF(AND(X38<>\"\",QCData!X38=\"\"),\"N\",IF(AND(X38<>\"\",QCData!X38<>\"\",X38<>QCData!X38),\"C\",IF(AND(QCData!X38<>\"\",X38=\"\"),\"D\",\"no cd er\"))))","v":"N"},{"$f":"IF(Y38=QCData!Y38,\"S\",IF(AND(Y38<>\"\",QCData!Y38=\"\"),\"N\",IF(AND(Y38<>\"\",QCData!Y38<>\"\",Y38<>QCData!Y38),\"C\",IF(AND(QCData!Y38<>\"\",Y38=\"\"),\"D\",\"no cd er\"))))","v":"N"},{"$f":"IF(Z38=QCData!Z38,\"S\",IF(AND(Z38<>\"\",QCData!Z38=\"\"),\"N\",IF(AND(Z38<>\"\",QCData!Z38<>\"\",Z38<>QCData!Z38),\"C\",IF(AND(QCData!Z38<>\"\",Z38=\"\"),\"D\",\"no cd er\"))))","v":"N"}]
[10,"",0,1,10,"NO","","",100,90,86,63,41,41,29,19,"","",8,5.19,92,95,96,"","","",null,null,null,null,null,null,null,null,null,null,null,null,null,null,null,null,null,null,null,null,null,null,null,null,null,null,10,null,0,1,10,"NO",null,null,100,90,86,63,41,41,29,19,null,null,8,5.19,92,95,96,null,null,null,null,null,null,null,null,null,null,null,null,null,null,null,null,null,null,null,null,null,null,null,null,null,null,null,null,null,null,null,null,null,null,null,null,null,null,null,null,null,null,null,null,null,null,null,null,null,null,null,null,null,null,null,null,null,null,null,null,null,null,null,null,null,null,null,null,null,null,null,null,null,null,null,null,null,null,null,null,null,{"$f":"IF(A39=QCData!A39,\"S\",IF(AND(A39<>\"\",QCData!A39=\"\"),\"N\",IF(AND(A39<>\"\",QCData!A39<>\"\",A39<>QCData!A39),\"C\",IF(AND(QCData!A39<>\"\",A39=\"\"),\"D\",\"no cd er\"))))","v":"N"},{"$f":"IF(B39=QCData!B39,\"S\",IF(AND(B39<>\"\",QCData!B39=\"\"),\"N\",IF(AND(B39<>\"\",QCData!B39<>\"\",B39<>QCData!B39),\"C\",IF(AND(QCData!B39<>\"\",B39=\"\"),\"D\",\"no cd er\"))))","v":"S"},{"$f":"IF(C39=QCData!C39,\"S\",IF(AND(C39<>\"\",QCData!C39=\"\"),\"N\",IF(AND(C39<>\"\",QCData!C39<>\"\",C39<>QCData!C39),\"C\",IF(AND(QCData!C39<>\"\",C39=\"\"),\"D\",\"no cd er\"))))","v":"S"},{"$f":"IF(D39=QCData!D39,\"S\",IF(AND(D39<>\"\",QCData!D39=\"\"),\"N\",IF(AND(D39<>\"\",QCData!D39<>\"\",D39<>QCData!D39),\"C\",IF(AND(QCData!D39<>\"\",D39=\"\"),\"D\",\"no cd er\"))))","v":"N"},{"$f":"IF(E39=QCData!E39,\"S\",IF(AND(E39<>\"\",QCData!E39=\"\"),\"N\",IF(AND(E39<>\"\",QCData!E39<>\"\",E39<>QCData!E39),\"C\",IF(AND(QCData!E39<>\"\",E39=\"\"),\"D\",\"no cd er\"))))","v":"N"},{"$f":"IF(F39=QCData!F39,\"S\",IF(AND(F39<>\"\",QCData!F39=\"\"),\"N\",IF(AND(F39<>\"\",QCData!F39<>\"\",F39<>QCData!F39),\"C\",IF(AND(QCData!F39<>\"\",F39=\"\"),\"D\",\"no cd er\"))))","v":"N"},{"$f":"IF(G39=QCData!G39,\"S\",IF(AND(G39<>\"\",QCData!G39=\"\"),\"N\",IF(AND(G39<>\"\",QCData!G39<>\"\",G39<>QCData!G39),\"C\",IF(AND(QCData!G39<>\"\",G39=\"\"),\"D\",\"no cd er\"))))","v":"S"},{"$f":"IF(H39=QCData!H39,\"S\",IF(AND(H39<>\"\",QCData!H39=\"\"),\"N\",IF(AND(H39<>\"\",QCData!H39<>\"\",H39<>QCData!H39),\"C\",IF(AND(QCData!H39<>\"\",H39=\"\"),\"D\",\"no cd er\"))))","v":"S"},{"$f":"IF(I39=QCData!I39,\"S\",IF(AND(I39<>\"\",QCData!I39=\"\"),\"N\",IF(AND(I39<>\"\",QCData!I39<>\"\",I39<>QCData!I39),\"C\",IF(AND(QCData!I39<>\"\",I39=\"\"),\"D\",\"no cd er\"))))","v":"N"},{"$f":"IF(J39=QCData!J39,\"S\",IF(AND(J39<>\"\",QCData!J39=\"\"),\"N\",IF(AND(J39<>\"\",QCData!J39<>\"\",J39<>QCData!J39),\"C\",IF(AND(QCData!J39<>\"\",J39=\"\"),\"D\",\"no cd er\"))))","v":"N"},{"$f":"IF(K39=QCData!K39,\"S\",IF(AND(K39<>\"\",QCData!K39=\"\"),\"N\",IF(AND(K39<>\"\",QCData!K39<>\"\",K39<>QCData!K39),\"C\",IF(AND(QCData!K39<>\"\",K39=\"\"),\"D\",\"no cd er\"))))","v":"N"},{"$f":"IF(L39=QCData!L39,\"S\",IF(AND(L39<>\"\",QCData!L39=\"\"),\"N\",IF(AND(L39<>\"\",QCData!L39<>\"\",L39<>QCData!L39),\"C\",IF(AND(QCData!L39<>\"\",L39=\"\"),\"D\",\"no cd er\"))))","v":"N"},{"$f":"IF(M39=QCData!M39,\"S\",IF(AND(M39<>\"\",QCData!M39=\"\"),\"N\",IF(AND(M39<>\"\",QCData!M39<>\"\",M39<>QCData!M39),\"C\",IF(AND(QCData!M39<>\"\",M39=\"\"),\"D\",\"no cd er\"))))","v":"N"},{"$f":"IF(N39=QCData!N39,\"S\",IF(AND(N39<>\"\",QCData!N39=\"\"),\"N\",IF(AND(N39<>\"\",QCData!N39<>\"\",N39<>QCData!N39),\"C\",IF(AND(QCData!N39<>\"\",N39=\"\"),\"D\",\"no cd er\"))))","v":"N"},{"$f":"IF(O39=QCData!O39,\"S\",IF(AND(O39<>\"\",QCData!O39=\"\"),\"N\",IF(AND(O39<>\"\",QCData!O39<>\"\",O39<>QCData!O39),\"C\",IF(AND(QCData!O39<>\"\",O39=\"\"),\"D\",\"no cd er\"))))","v":"N"},{"$f":"IF(P39=QCData!P39,\"S\",IF(AND(P39<>\"\",QCData!P39=\"\"),\"N\",IF(AND(P39<>\"\",QCData!P39<>\"\",P39<>QCData!P39),\"C\",IF(AND(QCData!P39<>\"\",P39=\"\"),\"D\",\"no cd er\"))))","v":"N"},{"$f":"IF(Q39=QCData!Q39,\"S\",IF(AND(Q39<>\"\",QCData!Q39=\"\"),\"N\",IF(AND(Q39<>\"\",QCData!Q39<>\"\",Q39<>QCData!Q39),\"C\",IF(AND(QCData!Q39<>\"\",Q39=\"\"),\"D\",\"no cd er\"))))","v":"S"},{"$f":"IF(R39=QCData!R39,\"S\",IF(AND(R39<>\"\",QCData!R39=\"\"),\"N\",IF(AND(R39<>\"\",QCData!R39<>\"\",R39<>QCData!R39),\"C\",IF(AND(QCData!R39<>\"\",R39=\"\"),\"D\",\"no cd er\"))))","v":"S"},{"$f":"IF(S39=QCData!S39,\"S\",IF(AND(S39<>\"\",QCData!S39=\"\"),\"N\",IF(AND(S39<>\"\",QCData!S39<>\"\",S39<>QCData!S39),\"C\",IF(AND(QCData!S39<>\"\",S39=\"\"),\"D\",\"no cd er\"))))","v":"N"},{"$f":"IF(T39=QCData!T39,\"S\",IF(AND(T39<>\"\",QCData!T39=\"\"),\"N\",IF(AND(T39<>\"\",QCData!T39<>\"\",T39<>QCData!T39),\"C\",IF(AND(QCData!T39<>\"\",T39=\"\"),\"D\",\"no cd er\"))))","v":"N"},{"$f":"IF(U39=QCData!U39,\"S\",IF(AND(U39<>\"\",QCData!U39=\"\"),\"N\",IF(AND(U39<>\"\",QCData!U39<>\"\",U39<>QCData!U39),\"C\",IF(AND(QCData!U39<>\"\",U39=\"\"),\"D\",\"no cd er\"))))","v":"N"},{"$f":"IF(V39=QCData!V39,\"S\",IF(AND(V39<>\"\",QCData!V39=\"\"),\"N\",IF(AND(V39<>\"\",QCData!V39<>\"\",V39<>QCData!V39),\"C\",IF(AND(QCData!V39<>\"\",V39=\"\"),\"D\",\"no cd er\"))))","v":"N"},{"$f":"IF(W39=QCData!W39,\"S\",IF(AND(W39<>\"\",QCData!W39=\"\"),\"N\",IF(AND(W39<>\"\",QCData!W39<>\"\",W39<>QCData!W39),\"C\",IF(AND(QCData!W39<>\"\",W39=\"\"),\"D\",\"no cd er\"))))","v":"N"},{"$f":"IF(X39=QCData!X39,\"S\",IF(AND(X39<>\"\",QCData!X39=\"\"),\"N\",IF(AND(X39<>\"\",QCData!X39<>\"\",X39<>QCData!X39),\"C\",IF(AND(QCData!X39<>\"\",X39=\"\"),\"D\",\"no cd er\"))))","v":"S"},{"$f":"IF(Y39=QCData!Y39,\"S\",IF(AND(Y39<>\"\",QCData!Y39=\"\"),\"N\",IF(AND(Y39<>\"\",QCData!Y39<>\"\",Y39<>QCData!Y39),\"C\",IF(AND(QCData!Y39<>\"\",Y39=\"\"),\"D\",\"no cd er\"))))","v":"S"},{"$f":"IF(Z39=QCData!Z39,\"S\",IF(AND(Z39<>\"\",QCData!Z39=\"\"),\"N\",IF(AND(Z39<>\"\",QCData!Z39<>\"\",Z39<>QCData!Z39),\"C\",IF(AND(QCData!Z39<>\"\",Z39=\"\"),\"D\",\"no cd er\"))))","v":"S"}]
[11,"",333,1,11,"NO","","",100,92,86,70,44,41,23,18,"","",9,5.0999999999999996,93.1,94.1,95.1,4.2,4.3,4.4000000000000004,null,null,null,null,null,null,null,null,null,null,null,null,null,null,null,null,null,null,null,null,null,null,null,null,null,null,11,null,333,1,11,"NO",null,null,100,92,86,70,44,41,23,18,null,null,9,5.0999999999999996,93.1,94.1,95.1,4.2,4.3,4.4000000000000004,null,null,null,null,null,null,null,null,null,null,null,null,null,null,null,null,null,null,null,null,null,null,null,null,null,null,null,null,null,null,null,null,null,null,null,null,null,null,null,null,null,null,null,null,null,null,null,null,null,null,null,null,null,null,null,null,null,null,null,null,null,null,null,null,null,null,null,null,null,null,null,null,null,null,null,null,null,null,{"$f":"IF(A40=QCData!A40,\"S\",IF(AND(A40<>\"\",QCData!A40=\"\"),\"N\",IF(AND(A40<>\"\",QCData!A40<>\"\",A40<>QCData!A40),\"C\",IF(AND(QCData!A40<>\"\",A40=\"\"),\"D\",\"no cd er\"))))","v":"N"},{"$f":"IF(B40=QCData!B40,\"S\",IF(AND(B40<>\"\",QCData!B40=\"\"),\"N\",IF(AND(B40<>\"\",QCData!B40<>\"\",B40<>QCData!B40),\"C\",IF(AND(QCData!B40<>\"\",B40=\"\"),\"D\",\"no cd er\"))))","v":"S"},{"$f":"IF(C40=QCData!C40,\"S\",IF(AND(C40<>\"\",QCData!C40=\"\"),\"N\",IF(AND(C40<>\"\",QCData!C40<>\"\",C40<>QCData!C40),\"C\",IF(AND(QCData!C40<>\"\",C40=\"\"),\"D\",\"no cd er\"))))","v":"N"},{"$f":"IF(D40=QCData!D40,\"S\",IF(AND(D40<>\"\",QCData!D40=\"\"),\"N\",IF(AND(D40<>\"\",QCData!D40<>\"\",D40<>QCData!D40),\"C\",IF(AND(QCData!D40<>\"\",D40=\"\"),\"D\",\"no cd er\"))))","v":"N"},{"$f":"IF(E40=QCData!E40,\"S\",IF(AND(E40<>\"\",QCData!E40=\"\"),\"N\",IF(AND(E40<>\"\",QCData!E40<>\"\",E40<>QCData!E40),\"C\",IF(AND(QCData!E40<>\"\",E40=\"\"),\"D\",\"no cd er\"))))","v":"N"},{"$f":"IF(F40=QCData!F40,\"S\",IF(AND(F40<>\"\",QCData!F40=\"\"),\"N\",IF(AND(F40<>\"\",QCData!F40<>\"\",F40<>QCData!F40),\"C\",IF(AND(QCData!F40<>\"\",F40=\"\"),\"D\",\"no cd er\"))))","v":"N"},{"$f":"IF(G40=QCData!G40,\"S\",IF(AND(G40<>\"\",QCData!G40=\"\"),\"N\",IF(AND(G40<>\"\",QCData!G40<>\"\",G40<>QCData!G40),\"C\",IF(AND(QCData!G40<>\"\",G40=\"\"),\"D\",\"no cd er\"))))","v":"S"},{"$f":"IF(H40=QCData!H40,\"S\",IF(AND(H40<>\"\",QCData!H40=\"\"),\"N\",IF(AND(H40<>\"\",QCData!H40<>\"\",H40<>QCData!H40),\"C\",IF(AND(QCData!H40<>\"\",H40=\"\"),\"D\",\"no cd er\"))))","v":"S"},{"$f":"IF(I40=QCData!I40,\"S\",IF(AND(I40<>\"\",QCData!I40=\"\"),\"N\",IF(AND(I40<>\"\",QCData!I40<>\"\",I40<>QCData!I40),\"C\",IF(AND(QCData!I40<>\"\",I40=\"\"),\"D\",\"no cd er\"))))","v":"N"},{"$f":"IF(J40=QCData!J40,\"S\",IF(AND(J40<>\"\",QCData!J40=\"\"),\"N\",IF(AND(J40<>\"\",QCData!J40<>\"\",J40<>QCData!J40),\"C\",IF(AND(QCData!J40<>\"\",J40=\"\"),\"D\",\"no cd er\"))))","v":"N"},{"$f":"IF(K40=QCData!K40,\"S\",IF(AND(K40<>\"\",QCData!K40=\"\"),\"N\",IF(AND(K40<>\"\",QCData!K40<>\"\",K40<>QCData!K40),\"C\",IF(AND(QCData!K40<>\"\",K40=\"\"),\"D\",\"no cd er\"))))","v":"N"},{"$f":"IF(L40=QCData!L40,\"S\",IF(AND(L40<>\"\",QCData!L40=\"\"),\"N\",IF(AND(L40<>\"\",QCData!L40<>\"\",L40<>QCData!L40),\"C\",IF(AND(QCData!L40<>\"\",L40=\"\"),\"D\",\"no cd er\"))))","v":"N"},{"$f":"IF(M40=QCData!M40,\"S\",IF(AND(M40<>\"\",QCData!M40=\"\"),\"N\",IF(AND(M40<>\"\",QCData!M40<>\"\",M40<>QCData!M40),\"C\",IF(AND(QCData!M40<>\"\",M40=\"\"),\"D\",\"no cd er\"))))","v":"N"},{"$f":"IF(N40=QCData!N40,\"S\",IF(AND(N40<>\"\",QCData!N40=\"\"),\"N\",IF(AND(N40<>\"\",QCData!N40<>\"\",N40<>QCData!N40),\"C\",IF(AND(QCData!N40<>\"\",N40=\"\"),\"D\",\"no cd er\"))))","v":"N"},{"$f":"IF(O40=QCData!O40,\"S\",IF(AND(O40<>\"\",QCData!O40=\"\"),\"N\",IF(AND(O40<>\"\",QCData!O40<>\"\",O40<>QCData!O40),\"C\",IF(AND(QCData!O40<>\"\",O40=\"\"),\"D\",\"no cd er\"))))","v":"N"},{"$f":"IF(P40=QCData!P40,\"S\",IF(AND(P40<>\"\",QCData!P40=\"\"),\"N\",IF(AND(P40<>\"\",QCData!P40<>\"\",P40<>QCData!P40),\"C\",IF(AND(QCData!P40<>\"\",P40=\"\"),\"D\",\"no cd er\"))))","v":"N"},{"$f":"IF(Q40=QCData!Q40,\"S\",IF(AND(Q40<>\"\",QCData!Q40=\"\"),\"N\",IF(AND(Q40<>\"\",QCData!Q40<>\"\",Q40<>QCData!Q40),\"C\",IF(AND(QCData!Q40<>\"\",Q40=\"\"),\"D\",\"no cd er\"))))","v":"S"},{"$f":"IF(R40=QCData!R40,\"S\",IF(AND(R40<>\"\",QCData!R40=\"\"),\"N\",IF(AND(R40<>\"\",QCData!R40<>\"\",R40<>QCData!R40),\"C\",IF(AND(QCData!R40<>\"\",R40=\"\"),\"D\",\"no cd er\"))))","v":"S"},{"$f":"IF(S40=QCData!S40,\"S\",IF(AND(S40<>\"\",QCData!S40=\"\"),\"N\",IF(AND(S40<>\"\",QCData!S40<>\"\",S40<>QCData!S40),\"C\",IF(AND(QCData!S40<>\"\",S40=\"\"),\"D\",\"no cd er\"))))","v":"N"},{"$f":"IF(T40=QCData!T40,\"S\",IF(AND(T40<>\"\",QCData!T40=\"\"),\"N\",IF(AND(T40<>\"\",QCData!T40<>\"\",T40<>QCData!T40),\"C\",IF(AND(QCData!T40<>\"\",T40=\"\"),\"D\",\"no cd er\"))))","v":"N"},{"$f":"IF(U40=QCData!U40,\"S\",IF(AND(U40<>\"\",QCData!U40=\"\"),\"N\",IF(AND(U40<>\"\",QCData!U40<>\"\",U40<>QCData!U40),\"C\",IF(AND(QCData!U40<>\"\",U40=\"\"),\"D\",\"no cd er\"))))","v":"N"},{"$f":"IF(V40=QCData!V40,\"S\",IF(AND(V40<>\"\",QCData!V40=\"\"),\"N\",IF(AND(V40<>\"\",QCData!V40<>\"\",V40<>QCData!V40),\"C\",IF(AND(QCData!V40<>\"\",V40=\"\"),\"D\",\"no cd er\"))))","v":"N"},{"$f":"IF(W40=QCData!W40,\"S\",IF(AND(W40<>\"\",QCData!W40=\"\"),\"N\",IF(AND(W40<>\"\",QCData!W40<>\"\",W40<>QCData!W40),\"C\",IF(AND(QCData!W40<>\"\",W40=\"\"),\"D\",\"no cd er\"))))","v":"N"},{"$f":"IF(X40=QCData!X40,\"S\",IF(AND(X40<>\"\",QCData!X40=\"\"),\"N\",IF(AND(X40<>\"\",QCData!X40<>\"\",X40<>QCData!X40),\"C\",IF(AND(QCData!X40<>\"\",X40=\"\"),\"D\",\"no cd er\"))))","v":"N"},{"$f":"IF(Y40=QCData!Y40,\"S\",IF(AND(Y40<>\"\",QCData!Y40=\"\"),\"N\",IF(AND(Y40<>\"\",QCData!Y40<>\"\",Y40<>QCData!Y40),\"C\",IF(AND(QCData!Y40<>\"\",Y40=\"\"),\"D\",\"no cd er\"))))","v":"N"},{"$f":"IF(Z40=QCData!Z40,\"S\",IF(AND(Z40<>\"\",QCData!Z40=\"\"),\"N\",IF(AND(Z40<>\"\",QCData!Z40<>\"\",Z40<>QCData!Z40),\"C\",IF(AND(QCData!Z40<>\"\",Z40=\"\"),\"D\",\"no cd er\"))))","v":"N"}]
[12,"",0,1,12,"NO","","",100,90,84,71,43,38,35,17,"","",6,5.2,93.4,92.1,92.1,"","","",null,null,null,null,null,null,null,null,null,null,null,null,null,null,null,null,null,null,null,null,null,null,null,null,null,null,12,null,0,1,12,"NO",null,null,100,90,84,71,43,38,35,17,null,null,6,5.2,93.4,92.1,92.1,null,null,null,null,null,null,null,null,null,null,null,null,null,null,null,null,null,null,null,null,null,null,null,null,null,null,null,null,null,null,null,null,null,null,null,null,null,null,null,null,null,null,null,null,null,null,null,null,null,null,null,null,null,null,null,null,null,null,null,null,null,null,null,null,null,null,null,null,null,null,null,null,null,null,null,null,null,null,null,null,null,{"$f":"IF(A41=QCData!A41,\"S\",IF(AND(A41<>\"\",QCData!A41=\"\"),\"N\",IF(AND(A41<>\"\",QCData!A41<>\"\",A41<>QCData!A41),\"C\",IF(AND(QCData!A41<>\"\",A41=\"\"),\"D\",\"no cd er\"))))","v":"N"},{"$f":"IF(B41=QCData!B41,\"S\",IF(AND(B41<>\"\",QCData!B41=\"\"),\"N\",IF(AND(B41<>\"\",QCData!B41<>\"\",B41<>QCData!B41),\"C\",IF(AND(QCData!B41<>\"\",B41=\"\"),\"D\",\"no cd er\"))))","v":"S"},{"$f":"IF(C41=QCData!C41,\"S\",IF(AND(C41<>\"\",QCData!C41=\"\"),\"N\",IF(AND(C41<>\"\",QCData!C41<>\"\",C41<>QCData!C41),\"C\",IF(AND(QCData!C41<>\"\",C41=\"\"),\"D\",\"no cd er\"))))","v":"S"},{"$f":"IF(D41=QCData!D41,\"S\",IF(AND(D41<>\"\",QCData!D41=\"\"),\"N\",IF(AND(D41<>\"\",QCData!D41<>\"\",D41<>QCData!D41),\"C\",IF(AND(QCData!D41<>\"\",D41=\"\"),\"D\",\"no cd er\"))))","v":"N"},{"$f":"IF(E41=QCData!E41,\"S\",IF(AND(E41<>\"\",QCData!E41=\"\"),\"N\",IF(AND(E41<>\"\",QCData!E41<>\"\",E41<>QCData!E41),\"C\",IF(AND(QCData!E41<>\"\",E41=\"\"),\"D\",\"no cd er\"))))","v":"N"},{"$f":"IF(F41=QCData!F41,\"S\",IF(AND(F41<>\"\",QCData!F41=\"\"),\"N\",IF(AND(F41<>\"\",QCData!F41<>\"\",F41<>QCData!F41),\"C\",IF(AND(QCData!F41<>\"\",F41=\"\"),\"D\",\"no cd er\"))))","v":"N"},{"$f":"IF(G41=QCData!G41,\"S\",IF(AND(G41<>\"\",QCData!G41=\"\"),\"N\",IF(AND(G41<>\"\",QCData!G41<>\"\",G41<>QCData!G41),\"C\",IF(AND(QCData!G41<>\"\",G41=\"\"),\"D\",\"no cd er\"))))","v":"S"},{"$f":"IF(H41=QCData!H41,\"S\",IF(AND(H41<>\"\",QCData!H41=\"\"),\"N\",IF(AND(H41<>\"\",QCData!H41<>\"\",H41<>QCData!H41),\"C\",IF(AND(QCData!H41<>\"\",H41=\"\"),\"D\",\"no cd er\"))))","v":"S"},{"$f":"IF(I41=QCData!I41,\"S\",IF(AND(I41<>\"\",QCData!I41=\"\"),\"N\",IF(AND(I41<>\"\",QCData!I41<>\"\",I41<>QCData!I41),\"C\",IF(AND(QCData!I41<>\"\",I41=\"\"),\"D\",\"no cd er\"))))","v":"N"},{"$f":"IF(J41=QCData!J41,\"S\",IF(AND(J41<>\"\",QCData!J41=\"\"),\"N\",IF(AND(J41<>\"\",QCData!J41<>\"\",J41<>QCData!J41),\"C\",IF(AND(QCData!J41<>\"\",J41=\"\"),\"D\",\"no cd er\"))))","v":"N"},{"$f":"IF(K41=QCData!K41,\"S\",IF(AND(K41<>\"\",QCData!K41=\"\"),\"N\",IF(AND(K41<>\"\",QCData!K41<>\"\",K41<>QCData!K41),\"C\",IF(AND(QCData!K41<>\"\",K41=\"\"),\"D\",\"no cd er\"))))","v":"N"},{"$f":"IF(L41=QCData!L41,\"S\",IF(AND(L41<>\"\",QCData!L41=\"\"),\"N\",IF(AND(L41<>\"\",QCData!L41<>\"\",L41<>QCData!L41),\"C\",IF(AND(QCData!L41<>\"\",L41=\"\"),\"D\",\"no cd er\"))))","v":"N"},{"$f":"IF(M41=QCData!M41,\"S\",IF(AND(M41<>\"\",QCData!M41=\"\"),\"N\",IF(AND(M41<>\"\",QCData!M41<>\"\",M41<>QCData!M41),\"C\",IF(AND(QCData!M41<>\"\",M41=\"\"),\"D\",\"no cd er\"))))","v":"N"},{"$f":"IF(N41=QCData!N41,\"S\",IF(AND(N41<>\"\",QCData!N41=\"\"),\"N\",IF(AND(N41<>\"\",QCData!N41<>\"\",N41<>QCData!N41),\"C\",IF(AND(QCData!N41<>\"\",N41=\"\"),\"D\",\"no cd er\"))))","v":"N"},{"$f":"IF(O41=QCData!O41,\"S\",IF(AND(O41<>\"\",QCData!O41=\"\"),\"N\",IF(AND(O41<>\"\",QCData!O41<>\"\",O41<>QCData!O41),\"C\",IF(AND(QCData!O41<>\"\",O41=\"\"),\"D\",\"no cd er\"))))","v":"N"},{"$f":"IF(P41=QCData!P41,\"S\",IF(AND(P41<>\"\",QCData!P41=\"\"),\"N\",IF(AND(P41<>\"\",QCData!P41<>\"\",P41<>QCData!P41),\"C\",IF(AND(QCData!P41<>\"\",P41=\"\"),\"D\",\"no cd er\"))))","v":"N"},{"$f":"IF(Q41=QCData!Q41,\"S\",IF(AND(Q41<>\"\",QCData!Q41=\"\"),\"N\",IF(AND(Q41<>\"\",QCData!Q41<>\"\",Q41<>QCData!Q41),\"C\",IF(AND(QCData!Q41<>\"\",Q41=\"\"),\"D\",\"no cd er\"))))","v":"S"},{"$f":"IF(R41=QCData!R41,\"S\",IF(AND(R41<>\"\",QCData!R41=\"\"),\"N\",IF(AND(R41<>\"\",QCData!R41<>\"\",R41<>QCData!R41),\"C\",IF(AND(QCData!R41<>\"\",R41=\"\"),\"D\",\"no cd er\"))))","v":"S"},{"$f":"IF(S41=QCData!S41,\"S\",IF(AND(S41<>\"\",QCData!S41=\"\"),\"N\",IF(AND(S41<>\"\",QCData!S41<>\"\",S41<>QCData!S41),\"C\",IF(AND(QCData!S41<>\"\",S41=\"\"),\"D\",\"no cd er\"))))","v":"N"},{"$f":"IF(T41=QCData!T41,\"S\",IF(AND(T41<>\"\",QCData!T41=\"\"),\"N\",IF(AND(T41<>\"\",QCData!T41<>\"\",T41<>QCData!T41),\"C\",IF(AND(QCData!T41<>\"\",T41=\"\"),\"D\",\"no cd er\"))))","v":"N"},{"$f":"IF(U41=QCData!U41,\"S\",IF(AND(U41<>\"\",QCData!U41=\"\"),\"N\",IF(AND(U41<>\"\",QCData!U41<>\"\",U41<>QCData!U41),\"C\",IF(AND(QCData!U41<>\"\",U41=\"\"),\"D\",\"no cd er\"))))","v":"N"},{"$f":"IF(V41=QCData!V41,\"S\",IF(AND(V41<>\"\",QCData!V41=\"\"),\"N\",IF(AND(V41<>\"\",QCData!V41<>\"\",V41<>QCData!V41),\"C\",IF(AND(QCData!V41<>\"\",V41=\"\"),\"D\",\"no cd er\"))))","v":"N"},{"$f":"IF(W41=QCData!W41,\"S\",IF(AND(W41<>\"\",QCData!W41=\"\"),\"N\",IF(AND(W41<>\"\",QCData!W41<>\"\",W41<>QCData!W41),\"C\",IF(AND(QCData!W41<>\"\",W41=\"\"),\"D\",\"no cd er\"))))","v":"N"},{"$f":"IF(X41=QCData!X41,\"S\",IF(AND(X41<>\"\",QCData!X41=\"\"),\"N\",IF(AND(X41<>\"\",QCData!X41<>\"\",X41<>QCData!X41),\"C\",IF(AND(QCData!X41<>\"\",X41=\"\"),\"D\",\"no cd er\"))))","v":"S"},{"$f":"IF(Y41=QCData!Y41,\"S\",IF(AND(Y41<>\"\",QCData!Y41=\"\"),\"N\",IF(AND(Y41<>\"\",QCData!Y41<>\"\",Y41<>QCData!Y41),\"C\",IF(AND(QCData!Y41<>\"\",Y41=\"\"),\"D\",\"no cd er\"))))","v":"S"},{"$f":"IF(Z41=QCData!Z41,\"S\",IF(AND(Z41<>\"\",QCData!Z41=\"\"),\"N\",IF(AND(Z41<>\"\",QCData!Z41<>\"\",Z41<>QCData!Z41),\"C\",IF(AND(QCData!Z41<>\"\",Z41=\"\"),\"D\",\"no cd er\"))))","v":"S"}]
[13,"2009-07-20",0,1,13,"NO","","",100,91,86,75,40,33,36,19,"","",5.4,5.14,93.4,92.1,92.1,3.8,3.9,4,null,null,null,null,null,null,null,null,null,null,null,null,null,null,null,null,null,null,null,null,null,null,null,null,null,null,13,40014,0,1,13,"NO",null,null,100,91,86,75,40,33,36,19,null,null,5.4,5.14,93.4,92.1,92.1,3.8,3.9,4,null,null,null,null,null,null,null,null,null,null,null,null,null,null,null,null,null,null,null,null,null,null,null,null,null,null,null,null,null,null,null,null,null,null,null,null,null,null,null,null,null,null,null,null,null,null,null,null,null,null,null,null,null,null,null,null,null,null,null,null,null,null,null,null,null,null,null,null,null,null,null,null,null,null,null,null,null,null,{"$f":"IF(A42=QCData!A42,\"S\",IF(AND(A42<>\"\",QCData!A42=\"\"),\"N\",IF(AND(A42<>\"\",QCData!A42<>\"\",A42<>QCData!A42),\"C\",IF(AND(QCData!A42<>\"\",A42=\"\"),\"D\",\"no cd er\"))))","v":"N"},{"$f":"IF(B42=QCData!B42,\"S\",IF(AND(B42<>\"\",QCData!B42=\"\"),\"N\",IF(AND(B42<>\"\",QCData!B42<>\"\",B42<>QCData!B42),\"C\",IF(AND(QCData!B42<>\"\",B42=\"\"),\"D\",\"no cd er\"))))","v":"N"},{"$f":"IF(C42=QCData!C42,\"S\",IF(AND(C42<>\"\",QCData!C42=\"\"),\"N\",IF(AND(C42<>\"\",QCData!C42<>\"\",C42<>QCData!C42),\"C\",IF(AND(QCData!C42<>\"\",C42=\"\"),\"D\",\"no cd er\"))))","v":"S"},{"$f":"IF(D42=QCData!D42,\"S\",IF(AND(D42<>\"\",QCData!D42=\"\"),\"N\",IF(AND(D42<>\"\",QCData!D42<>\"\",D42<>QCData!D42),\"C\",IF(AND(QCData!D42<>\"\",D42=\"\"),\"D\",\"no cd er\"))))","v":"N"},{"$f":"IF(E42=QCData!E42,\"S\",IF(AND(E42<>\"\",QCData!E42=\"\"),\"N\",IF(AND(E42<>\"\",QCData!E42<>\"\",E42<>QCData!E42),\"C\",IF(AND(QCData!E42<>\"\",E42=\"\"),\"D\",\"no cd er\"))))","v":"N"},{"$f":"IF(F42=QCData!F42,\"S\",IF(AND(F42<>\"\",QCData!F42=\"\"),\"N\",IF(AND(F42<>\"\",QCData!F42<>\"\",F42<>QCData!F42),\"C\",IF(AND(QCData!F42<>\"\",F42=\"\"),\"D\",\"no cd er\"))))","v":"N"},{"$f":"IF(G42=QCData!G42,\"S\",IF(AND(G42<>\"\",QCData!G42=\"\"),\"N\",IF(AND(G42<>\"\",QCData!G42<>\"\",G42<>QCData!G42),\"C\",IF(AND(QCData!G42<>\"\",G42=\"\"),\"D\",\"no cd er\"))))","v":"S"},{"$f":"IF(H42=QCData!H42,\"S\",IF(AND(H42<>\"\",QCData!H42=\"\"),\"N\",IF(AND(H42<>\"\",QCData!H42<>\"\",H42<>QCData!H42),\"C\",IF(AND(QCData!H42<>\"\",H42=\"\"),\"D\",\"no cd er\"))))","v":"S"},{"$f":"IF(I42=QCData!I42,\"S\",IF(AND(I42<>\"\",QCData!I42=\"\"),\"N\",IF(AND(I42<>\"\",QCData!I42<>\"\",I42<>QCData!I42),\"C\",IF(AND(QCData!I42<>\"\",I42=\"\"),\"D\",\"no cd er\"))))","v":"N"},{"$f":"IF(J42=QCData!J42,\"S\",IF(AND(J42<>\"\",QCData!J42=\"\"),\"N\",IF(AND(J42<>\"\",QCData!J42<>\"\",J42<>QCData!J42),\"C\",IF(AND(QCData!J42<>\"\",J42=\"\"),\"D\",\"no cd er\"))))","v":"N"},{"$f":"IF(K42=QCData!K42,\"S\",IF(AND(K42<>\"\",QCData!K42=\"\"),\"N\",IF(AND(K42<>\"\",QCData!K42<>\"\",K42<>QCData!K42),\"C\",IF(AND(QCData!K42<>\"\",K42=\"\"),\"D\",\"no cd er\"))))","v":"N"},{"$f":"IF(L42=QCData!L42,\"S\",IF(AND(L42<>\"\",QCData!L42=\"\"),\"N\",IF(AND(L42<>\"\",QCData!L42<>\"\",L42<>QCData!L42),\"C\",IF(AND(QCData!L42<>\"\",L42=\"\"),\"D\",\"no cd er\"))))","v":"N"},{"$f":"IF(M42=QCData!M42,\"S\",IF(AND(M42<>\"\",QCData!M42=\"\"),\"N\",IF(AND(M42<>\"\",QCData!M42<>\"\",M42<>QCData!M42),\"C\",IF(AND(QCData!M42<>\"\",M42=\"\"),\"D\",\"no cd er\"))))","v":"N"},{"$f":"IF(N42=QCData!N42,\"S\",IF(AND(N42<>\"\",QCData!N42=\"\"),\"N\",IF(AND(N42<>\"\",QCData!N42<>\"\",N42<>QCData!N42),\"C\",IF(AND(QCData!N42<>\"\",N42=\"\"),\"D\",\"no cd er\"))))","v":"N"},{"$f":"IF(O42=QCData!O42,\"S\",IF(AND(O42<>\"\",QCData!O42=\"\"),\"N\",IF(AND(O42<>\"\",QCData!O42<>\"\",O42<>QCData!O42),\"C\",IF(AND(QCData!O42<>\"\",O42=\"\"),\"D\",\"no cd er\"))))","v":"N"},{"$f":"IF(P42=QCData!P42,\"S\",IF(AND(P42<>\"\",QCData!P42=\"\"),\"N\",IF(AND(P42<>\"\",QCData!P42<>\"\",P42<>QCData!P42),\"C\",IF(AND(QCData!P42<>\"\",P42=\"\"),\"D\",\"no cd er\"))))","v":"N"},{"$f":"IF(Q42=QCData!Q42,\"S\",IF(AND(Q42<>\"\",QCData!Q42=\"\"),\"N\",IF(AND(Q42<>\"\",QCData!Q42<>\"\",Q42<>QCData!Q42),\"C\",IF(AND(QCData!Q42<>\"\",Q42=\"\"),\"D\",\"no cd er\"))))","v":"S"},{"$f":"IF(R42=QCData!R42,\"S\",IF(AND(R42<>\"\",QCData!R42=\"\"),\"N\",IF(AND(R42<>\"\",QCData!R42<>\"\",R42<>QCData!R42),\"C\",IF(AND(QCData!R42<>\"\",R42=\"\"),\"D\",\"no cd er\"))))","v":"S"},{"$f":"IF(S42=QCData!S42,\"S\",IF(AND(S42<>\"\",QCData!S42=\"\"),\"N\",IF(AND(S42<>\"\",QCData!S42<>\"\",S42<>QCData!S42),\"C\",IF(AND(QCData!S42<>\"\",S42=\"\"),\"D\",\"no cd er\"))))","v":"N"},{"$f":"IF(T42=QCData!T42,\"S\",IF(AND(T42<>\"\",QCData!T42=\"\"),\"N\",IF(AND(T42<>\"\",QCData!T42<>\"\",T42<>QCData!T42),\"C\",IF(AND(QCData!T42<>\"\",T42=\"\"),\"D\",\"no cd er\"))))","v":"N"},{"$f":"IF(U42=QCData!U42,\"S\",IF(AND(U42<>\"\",QCData!U42=\"\"),\"N\",IF(AND(U42<>\"\",QCData!U42<>\"\",U42<>QCData!U42),\"C\",IF(AND(QCData!U42<>\"\",U42=\"\"),\"D\",\"no cd er\"))))","v":"N"},{"$f":"IF(V42=QCData!V42,\"S\",IF(AND(V42<>\"\",QCData!V42=\"\"),\"N\",IF(AND(V42<>\"\",QCData!V42<>\"\",V42<>QCData!V42),\"C\",IF(AND(QCData!V42<>\"\",V42=\"\"),\"D\",\"no cd er\"))))","v":"N"},{"$f":"IF(W42=QCData!W42,\"S\",IF(AND(W42<>\"\",QCData!W42=\"\"),\"N\",IF(AND(W42<>\"\",QCData!W42<>\"\",W42<>QCData!W42),\"C\",IF(AND(QCData!W42<>\"\",W42=\"\"),\"D\",\"no cd er\"))))","v":"N"},{"$f":"IF(X42=QCData!X42,\"S\",IF(AND(X42<>\"\",QCData!X42=\"\"),\"N\",IF(AND(X42<>\"\",QCData!X42<>\"\",X42<>QCData!X42),\"C\",IF(AND(QCData!X42<>\"\",X42=\"\"),\"D\",\"no cd er\"))))","v":"N"},{"$f":"IF(Y42=QCData!Y42,\"S\",IF(AND(Y42<>\"\",QCData!Y42=\"\"),\"N\",IF(AND(Y42<>\"\",QCData!Y42<>\"\",Y42<>QCData!Y42),\"C\",IF(AND(QCData!Y42<>\"\",Y42=\"\"),\"D\",\"no cd er\"))))","v":"N"},{"$f":"IF(Z42=QCData!Z42,\"S\",IF(AND(Z42<>\"\",QCData!Z42=\"\"),\"N\",IF(AND(Z42<>\"\",QCData!Z42<>\"\",Z42<>QCData!Z42),\"C\",IF(AND(QCData!Z42<>\"\",Z42=\"\"),\"D\",\"no cd er\"))))","v":"N"}]
[14,"",0,1,14,"NO","","",100,94,87,77,41,33,22,18,"","",5.8,5.2,92,95,96,"","","",null,null,null,null,null,null,null,null,null,null,null,null,null,null,null,null,null,null,null,null,null,null,null,null,null,null,14,null,0,1,14,"NO",null,null,100,94,87,77,41,33,22,18,null,null,5.8,5.2,92,95,96,null,null,null,null,null,null,null,null,null,null,null,null,null,null,null,null,null,null,null,null,null,null,null,null,null,null,null,null,null,null,null,null,null,null,null,null,null,null,null,null,null,null,null,null,null,null,null,null,null,null,null,null,null,null,null,null,null,null,null,null,null,null,null,null,null,null,null,null,null,null,null,null,null,null,null,null,null,null,null,null,null,{"$f":"IF(A43=QCData!A43,\"S\",IF(AND(A43<>\"\",QCData!A43=\"\"),\"N\",IF(AND(A43<>\"\",QCData!A43<>\"\",A43<>QCData!A43),\"C\",IF(AND(QCData!A43<>\"\",A43=\"\"),\"D\",\"no cd er\"))))","v":"N"},{"$f":"IF(B43=QCData!B43,\"S\",IF(AND(B43<>\"\",QCData!B43=\"\"),\"N\",IF(AND(B43<>\"\",QCData!B43<>\"\",B43<>QCData!B43),\"C\",IF(AND(QCData!B43<>\"\",B43=\"\"),\"D\",\"no cd er\"))))","v":"S"},{"$f":"IF(C43=QCData!C43,\"S\",IF(AND(C43<>\"\",QCData!C43=\"\"),\"N\",IF(AND(C43<>\"\",QCData!C43<>\"\",C43<>QCData!C43),\"C\",IF(AND(QCData!C43<>\"\",C43=\"\"),\"D\",\"no cd er\"))))","v":"S"},{"$f":"IF(D43=QCData!D43,\"S\",IF(AND(D43<>\"\",QCData!D43=\"\"),\"N\",IF(AND(D43<>\"\",QCData!D43<>\"\",D43<>QCData!D43),\"C\",IF(AND(QCData!D43<>\"\",D43=\"\"),\"D\",\"no cd er\"))))","v":"N"},{"$f":"IF(E43=QCData!E43,\"S\",IF(AND(E43<>\"\",QCData!E43=\"\"),\"N\",IF(AND(E43<>\"\",QCData!E43<>\"\",E43<>QCData!E43),\"C\",IF(AND(QCData!E43<>\"\",E43=\"\"),\"D\",\"no cd er\"))))","v":"N"},{"$f":"IF(F43=QCData!F43,\"S\",IF(AND(F43<>\"\",QCData!F43=\"\"),\"N\",IF(AND(F43<>\"\",QCData!F43<>\"\",F43<>QCData!F43),\"C\",IF(AND(QCData!F43<>\"\",F43=\"\"),\"D\",\"no cd er\"))))","v":"N"},{"$f":"IF(G43=QCData!G43,\"S\",IF(AND(G43<>\"\",QCData!G43=\"\"),\"N\",IF(AND(G43<>\"\",QCData!G43<>\"\",G43<>QCData!G43),\"C\",IF(AND(QCData!G43<>\"\",G43=\"\"),\"D\",\"no cd er\"))))","v":"S"},{"$f":"IF(H43=QCData!H43,\"S\",IF(AND(H43<>\"\",QCData!H43=\"\"),\"N\",IF(AND(H43<>\"\",QCData!H43<>\"\",H43<>QCData!H43),\"C\",IF(AND(QCData!H43<>\"\",H43=\"\"),\"D\",\"no cd er\"))))","v":"S"},{"$f":"IF(I43=QCData!I43,\"S\",IF(AND(I43<>\"\",QCData!I43=\"\"),\"N\",IF(AND(I43<>\"\",QCData!I43<>\"\",I43<>QCData!I43),\"C\",IF(AND(QCData!I43<>\"\",I43=\"\"),\"D\",\"no cd er\"))))","v":"N"},{"$f":"IF(J43=QCData!J43,\"S\",IF(AND(J43<>\"\",QCData!J43=\"\"),\"N\",IF(AND(J43<>\"\",QCData!J43<>\"\",J43<>QCData!J43),\"C\",IF(AND(QCData!J43<>\"\",J43=\"\"),\"D\",\"no cd er\"))))","v":"N"},{"$f":"IF(K43=QCData!K43,\"S\",IF(AND(K43<>\"\",QCData!K43=\"\"),\"N\",IF(AND(K43<>\"\",QCData!K43<>\"\",K43<>QCData!K43),\"C\",IF(AND(QCData!K43<>\"\",K43=\"\"),\"D\",\"no cd er\"))))","v":"N"},{"$f":"IF(L43=QCData!L43,\"S\",IF(AND(L43<>\"\",QCData!L43=\"\"),\"N\",IF(AND(L43<>\"\",QCData!L43<>\"\",L43<>QCData!L43),\"C\",IF(AND(QCData!L43<>\"\",L43=\"\"),\"D\",\"no cd er\"))))","v":"N"},{"$f":"IF(M43=QCData!M43,\"S\",IF(AND(M43<>\"\",QCData!M43=\"\"),\"N\",IF(AND(M43<>\"\",QCData!M43<>\"\",M43<>QCData!M43),\"C\",IF(AND(QCData!M43<>\"\",M43=\"\"),\"D\",\"no cd er\"))))","v":"N"},{"$f":"IF(N43=QCData!N43,\"S\",IF(AND(N43<>\"\",QCData!N43=\"\"),\"N\",IF(AND(N43<>\"\",QCData!N43<>\"\",N43<>QCData!N43),\"C\",IF(AND(QCData!N43<>\"\",N43=\"\"),\"D\",\"no cd er\"))))","v":"N"},{"$f":"IF(O43=QCData!O43,\"S\",IF(AND(O43<>\"\",QCData!O43=\"\"),\"N\",IF(AND(O43<>\"\",QCData!O43<>\"\",O43<>QCData!O43),\"C\",IF(AND(QCData!O43<>\"\",O43=\"\"),\"D\",\"no cd er\"))))","v":"N"},{"$f":"IF(P43=QCData!P43,\"S\",IF(AND(P43<>\"\",QCData!P43=\"\"),\"N\",IF(AND(P43<>\"\",QCData!P43<>\"\",P43<>QCData!P43),\"C\",IF(AND(QCData!P43<>\"\",P43=\"\"),\"D\",\"no cd er\"))))","v":"N"},{"$f":"IF(Q43=QCData!Q43,\"S\",IF(AND(Q43<>\"\",QCData!Q43=\"\"),\"N\",IF(AND(Q43<>\"\",QCData!Q43<>\"\",Q43<>QCData!Q43),\"C\",IF(AND(QCData!Q43<>\"\",Q43=\"\"),\"D\",\"no cd er\"))))","v":"S"},{"$f":"IF(R43=QCData!R43,\"S\",IF(AND(R43<>\"\",QCData!R43=\"\"),\"N\",IF(AND(R43<>\"\",QCData!R43<>\"\",R43<>QCData!R43),\"C\",IF(AND(QCData!R43<>\"\",R43=\"\"),\"D\",\"no cd er\"))))","v":"S"},{"$f":"IF(S43=QCData!S43,\"S\",IF(AND(S43<>\"\",QCData!S43=\"\"),\"N\",IF(AND(S43<>\"\",QCData!S43<>\"\",S43<>QCData!S43),\"C\",IF(AND(QCData!S43<>\"\",S43=\"\"),\"D\",\"no cd er\"))))","v":"N"},{"$f":"IF(T43=QCData!T43,\"S\",IF(AND(T43<>\"\",QCData!T43=\"\"),\"N\",IF(AND(T43<>\"\",QCData!T43<>\"\",T43<>QCData!T43),\"C\",IF(AND(QCData!T43<>\"\",T43=\"\"),\"D\",\"no cd er\"))))","v":"N"},{"$f":"IF(U43=QCData!U43,\"S\",IF(AND(U43<>\"\",QCData!U43=\"\"),\"N\",IF(AND(U43<>\"\",QCData!U43<>\"\",U43<>QCData!U43),\"C\",IF(AND(QCData!U43<>\"\",U43=\"\"),\"D\",\"no cd er\"))))","v":"N"},{"$f":"IF(V43=QCData!V43,\"S\",IF(AND(V43<>\"\",QCData!V43=\"\"),\"N\",IF(AND(V43<>\"\",QCData!V43<>\"\",V43<>QCData!V43),\"C\",IF(AND(QCData!V43<>\"\",V43=\"\"),\"D\",\"no cd er\"))))","v":"N"},{"$f":"IF(W43=QCData!W43,\"S\",IF(AND(W43<>\"\",QCData!W43=\"\"),\"N\",IF(AND(W43<>\"\",QCData!W43<>\"\",W43<>QCData!W43),\"C\",IF(AND(QCData!W43<>\"\",W43=\"\"),\"D\",\"no cd er\"))))","v":"N"},{"$f":"IF(X43=QCData!X43,\"S\",IF(AND(X43<>\"\",QCData!X43=\"\"),\"N\",IF(AND(X43<>\"\",QCData!X43<>\"\",X43<>QCData!X43),\"C\",IF(AND(QCData!X43<>\"\",X43=\"\"),\"D\",\"no cd er\"))))","v":"S"},{"$f":"IF(Y43=QCData!Y43,\"S\",IF(AND(Y43<>\"\",QCData!Y43=\"\"),\"N\",IF(AND(Y43<>\"\",QCData!Y43<>\"\",Y43<>QCData!Y43),\"C\",IF(AND(QCData!Y43<>\"\",Y43=\"\"),\"D\",\"no cd er\"))))","v":"S"},{"$f":"IF(Z43=QCData!Z43,\"S\",IF(AND(Z43<>\"\",QCData!Z43=\"\"),\"N\",IF(AND(Z43<>\"\",QCData!Z43<>\"\",Z43<>QCData!Z43),\"C\",IF(AND(QCData!Z43<>\"\",Z43=\"\"),\"D\",\"no cd er\"))))","v":"S"}]
[15,"2009-07-24",0,1,15,"NO","","",100,93,87,77,46,39,29,17,"","",4.9000000000000004,5.24,93.1,94.1,95.1,4.5,4.5999999999999996,4.7,null,null,null,null,null,null,null,null,null,null,null,null,null,null,null,null,null,null,null,null,null,null,null,null,null,null,15,40018,0,1,15,"NO",null,null,100,93,87,77,46,39,29,17,null,null,4.9000000000000004,5.24,93.1,94.1,95.1,4.5,4.5999999999999996,4.7,null,null,null,null,null,null,null,null,null,null,null,null,null,null,null,null,null,null,null,null,null,null,null,null,null,null,null,null,null,null,null,null,null,null,null,null,null,null,null,null,null,null,null,null,null,null,null,null,null,null,null,null,null,null,null,null,null,null,null,null,null,null,null,null,null,null,null,null,null,null,null,null,null,null,null,null,null,null,{"$f":"IF(A44=QCData!A44,\"S\",IF(AND(A44<>\"\",QCData!A44=\"\"),\"N\",IF(AND(A44<>\"\",QCData!A44<>\"\",A44<>QCData!A44),\"C\",IF(AND(QCData!A44<>\"\",A44=\"\"),\"D\",\"no cd er\"))))","v":"N"},{"$f":"IF(B44=QCData!B44,\"S\",IF(AND(B44<>\"\",QCData!B44=\"\"),\"N\",IF(AND(B44<>\"\",QCData!B44<>\"\",B44<>QCData!B44),\"C\",IF(AND(QCData!B44<>\"\",B44=\"\"),\"D\",\"no cd er\"))))","v":"N"},{"$f":"IF(C44=QCData!C44,\"S\",IF(AND(C44<>\"\",QCData!C44=\"\"),\"N\",IF(AND(C44<>\"\",QCData!C44<>\"\",C44<>QCData!C44),\"C\",IF(AND(QCData!C44<>\"\",C44=\"\"),\"D\",\"no cd er\"))))","v":"S"},{"$f":"IF(D44=QCData!D44,\"S\",IF(AND(D44<>\"\",QCData!D44=\"\"),\"N\",IF(AND(D44<>\"\",QCData!D44<>\"\",D44<>QCData!D44),\"C\",IF(AND(QCData!D44<>\"\",D44=\"\"),\"D\",\"no cd er\"))))","v":"N"},{"$f":"IF(E44=QCData!E44,\"S\",IF(AND(E44<>\"\",QCData!E44=\"\"),\"N\",IF(AND(E44<>\"\",QCData!E44<>\"\",E44<>QCData!E44),\"C\",IF(AND(QCData!E44<>\"\",E44=\"\"),\"D\",\"no cd er\"))))","v":"N"},{"$f":"IF(F44=QCData!F44,\"S\",IF(AND(F44<>\"\",QCData!F44=\"\"),\"N\",IF(AND(F44<>\"\",QCData!F44<>\"\",F44<>QCData!F44),\"C\",IF(AND(QCData!F44<>\"\",F44=\"\"),\"D\",\"no cd er\"))))","v":"N"},{"$f":"IF(G44=QCData!G44,\"S\",IF(AND(G44<>\"\",QCData!G44=\"\"),\"N\",IF(AND(G44<>\"\",QCData!G44<>\"\",G44<>QCData!G44),\"C\",IF(AND(QCData!G44<>\"\",G44=\"\"),\"D\",\"no cd er\"))))","v":"S"},{"$f":"IF(H44=QCData!H44,\"S\",IF(AND(H44<>\"\",QCData!H44=\"\"),\"N\",IF(AND(H44<>\"\",QCData!H44<>\"\",H44<>QCData!H44),\"C\",IF(AND(QCData!H44<>\"\",H44=\"\"),\"D\",\"no cd er\"))))","v":"S"},{"$f":"IF(I44=QCData!I44,\"S\",IF(AND(I44<>\"\",QCData!I44=\"\"),\"N\",IF(AND(I44<>\"\",QCData!I44<>\"\",I44<>QCData!I44),\"C\",IF(AND(QCData!I44<>\"\",I44=\"\"),\"D\",\"no cd er\"))))","v":"N"},{"$f":"IF(J44=QCData!J44,\"S\",IF(AND(J44<>\"\",QCData!J44=\"\"),\"N\",IF(AND(J44<>\"\",QCData!J44<>\"\",J44<>QCData!J44),\"C\",IF(AND(QCData!J44<>\"\",J44=\"\"),\"D\",\"no cd er\"))))","v":"N"},{"$f":"IF(K44=QCData!K44,\"S\",IF(AND(K44<>\"\",QCData!K44=\"\"),\"N\",IF(AND(K44<>\"\",QCData!K44<>\"\",K44<>QCData!K44),\"C\",IF(AND(QCData!K44<>\"\",K44=\"\"),\"D\",\"no cd er\"))))","v":"N"},{"$f":"IF(L44=QCData!L44,\"S\",IF(AND(L44<>\"\",QCData!L44=\"\"),\"N\",IF(AND(L44<>\"\",QCData!L44<>\"\",L44<>QCData!L44),\"C\",IF(AND(QCData!L44<>\"\",L44=\"\"),\"D\",\"no cd er\"))))","v":"N"},{"$f":"IF(M44=QCData!M44,\"S\",IF(AND(M44<>\"\",QCData!M44=\"\"),\"N\",IF(AND(M44<>\"\",QCData!M44<>\"\",M44<>QCData!M44),\"C\",IF(AND(QCData!M44<>\"\",M44=\"\"),\"D\",\"no cd er\"))))","v":"N"},{"$f":"IF(N44=QCData!N44,\"S\",IF(AND(N44<>\"\",QCData!N44=\"\"),\"N\",IF(AND(N44<>\"\",QCData!N44<>\"\",N44<>QCData!N44),\"C\",IF(AND(QCData!N44<>\"\",N44=\"\"),\"D\",\"no cd er\"))))","v":"N"},{"$f":"IF(O44=QCData!O44,\"S\",IF(AND(O44<>\"\",QCData!O44=\"\"),\"N\",IF(AND(O44<>\"\",QCData!O44<>\"\",O44<>QCData!O44),\"C\",IF(AND(QCData!O44<>\"\",O44=\"\"),\"D\",\"no cd er\"))))","v":"N"},{"$f":"IF(P44=QCData!P44,\"S\",IF(AND(P44<>\"\",QCData!P44=\"\"),\"N\",IF(AND(P44<>\"\",QCData!P44<>\"\",P44<>QCData!P44),\"C\",IF(AND(QCData!P44<>\"\",P44=\"\"),\"D\",\"no cd er\"))))","v":"N"},{"$f":"IF(Q44=QCData!Q44,\"S\",IF(AND(Q44<>\"\",QCData!Q44=\"\"),\"N\",IF(AND(Q44<>\"\",QCData!Q44<>\"\",Q44<>QCData!Q44),\"C\",IF(AND(QCData!Q44<>\"\",Q44=\"\"),\"D\",\"no cd er\"))))","v":"S"},{"$f":"IF(R44=QCData!R44,\"S\",IF(AND(R44<>\"\",QCData!R44=\"\"),\"N\",IF(AND(R44<>\"\",QCData!R44<>\"\",R44<>QCData!R44),\"C\",IF(AND(QCData!R44<>\"\",R44=\"\"),\"D\",\"no cd er\"))))","v":"S"},{"$f":"IF(S44=QCData!S44,\"S\",IF(AND(S44<>\"\",QCData!S44=\"\"),\"N\",IF(AND(S44<>\"\",QCData!S44<>\"\",S44<>QCData!S44),\"C\",IF(AND(QCData!S44<>\"\",S44=\"\"),\"D\",\"no cd er\"))))","v":"N"},{"$f":"IF(T44=QCData!T44,\"S\",IF(AND(T44<>\"\",QCData!T44=\"\"),\"N\",IF(AND(T44<>\"\",QCData!T44<>\"\",T44<>QCData!T44),\"C\",IF(AND(QCData!T44<>\"\",T44=\"\"),\"D\",\"no cd er\"))))","v":"N"},{"$f":"IF(U44=QCData!U44,\"S\",IF(AND(U44<>\"\",QCData!U44=\"\"),\"N\",IF(AND(U44<>\"\",QCData!U44<>\"\",U44<>QCData!U44),\"C\",IF(AND(QCData!U44<>\"\",U44=\"\"),\"D\",\"no cd er\"))))","v":"N"},{"$f":"IF(V44=QCData!V44,\"S\",IF(AND(V44<>\"\",QCData!V44=\"\"),\"N\",IF(AND(V44<>\"\",QCData!V44<>\"\",V44<>QCData!V44),\"C\",IF(AND(QCData!V44<>\"\",V44=\"\"),\"D\",\"no cd er\"))))","v":"N"},{"$f":"IF(W44=QCData!W44,\"S\",IF(AND(W44<>\"\",QCData!W44=\"\"),\"N\",IF(AND(W44<>\"\",QCData!W44<>\"\",W44<>QCData!W44),\"C\",IF(AND(QCData!W44<>\"\",W44=\"\"),\"D\",\"no cd er\"))))","v":"N"},{"$f":"IF(X44=QCData!X44,\"S\",IF(AND(X44<>\"\",QCData!X44=\"\"),\"N\",IF(AND(X44<>\"\",QCData!X44<>\"\",X44<>QCData!X44),\"C\",IF(AND(QCData!X44<>\"\",X44=\"\"),\"D\",\"no cd er\"))))","v":"N"},{"$f":"IF(Y44=QCData!Y44,\"S\",IF(AND(Y44<>\"\",QCData!Y44=\"\"),\"N\",IF(AND(Y44<>\"\",QCData!Y44<>\"\",Y44<>QCData!Y44),\"C\",IF(AND(QCData!Y44<>\"\",Y44=\"\"),\"D\",\"no cd er\"))))","v":"N"},{"$f":"IF(Z44=QCData!Z44,\"S\",IF(AND(Z44<>\"\",QCData!Z44=\"\"),\"N\",IF(AND(Z44<>\"\",QCData!Z44<>\"\",Z44<>QCData!Z44),\"C\",IF(AND(QCData!Z44<>\"\",Z44=\"\"),\"D\",\"no cd er\"))))","v":"N"}]
[16,"2009-08-23",0,1,16,"NO","","",100,99,86,77,46,38,23,16,"","",6.8,4.91,93.1,94.1,95.1,"","","",null,null,null,null,null,null,null,null,null,null,null,null,null,null,null,null,null,null,null,null,null,null,null,null,null,null,16,40048,0,1,16,"NO",null,null,100,99,86,77,46,38,23,16,null,null,6.8,4.91,93.1,94.1,95.1,null,null,null,null,null,null,null,null,null,null,null,null,null,null,null,null,null,null,null,null,null,null,null,null,null,null,null,null,null,null,null,null,null,null,null,null,null,null,null,null,null,null,null,null,null,null,null,null,null,null,null,null,null,null,null,null,null,null,null,null,null,null,null,null,null,null,null,null,null,null,null,null,null,null,null,null,null,null,null,null,null,{"$f":"IF(A45=QCData!A45,\"S\",IF(AND(A45<>\"\",QCData!A45=\"\"),\"N\",IF(AND(A45<>\"\",QCData!A45<>\"\",A45<>QCData!A45),\"C\",IF(AND(QCData!A45<>\"\",A45=\"\"),\"D\",\"no cd er\"))))","v":"N"},{"$f":"IF(B45=QCData!B45,\"S\",IF(AND(B45<>\"\",QCData!B45=\"\"),\"N\",IF(AND(B45<>\"\",QCData!B45<>\"\",B45<>QCData!B45),\"C\",IF(AND(QCData!B45<>\"\",B45=\"\"),\"D\",\"no cd er\"))))","v":"N"},{"$f":"IF(C45=QCData!C45,\"S\",IF(AND(C45<>\"\",QCData!C45=\"\"),\"N\",IF(AND(C45<>\"\",QCData!C45<>\"\",C45<>QCData!C45),\"C\",IF(AND(QCData!C45<>\"\",C45=\"\"),\"D\",\"no cd er\"))))","v":"S"},{"$f":"IF(D45=QCData!D45,\"S\",IF(AND(D45<>\"\",QCData!D45=\"\"),\"N\",IF(AND(D45<>\"\",QCData!D45<>\"\",D45<>QCData!D45),\"C\",IF(AND(QCData!D45<>\"\",D45=\"\"),\"D\",\"no cd er\"))))","v":"N"},{"$f":"IF(E45=QCData!E45,\"S\",IF(AND(E45<>\"\",QCData!E45=\"\"),\"N\",IF(AND(E45<>\"\",QCData!E45<>\"\",E45<>QCData!E45),\"C\",IF(AND(QCData!E45<>\"\",E45=\"\"),\"D\",\"no cd er\"))))","v":"N"},{"$f":"IF(F45=QCData!F45,\"S\",IF(AND(F45<>\"\",QCData!F45=\"\"),\"N\",IF(AND(F45<>\"\",QCData!F45<>\"\",F45<>QCData!F45),\"C\",IF(AND(QCData!F45<>\"\",F45=\"\"),\"D\",\"no cd er\"))))","v":"N"},{"$f":"IF(G45=QCData!G45,\"S\",IF(AND(G45<>\"\",QCData!G45=\"\"),\"N\",IF(AND(G45<>\"\",QCData!G45<>\"\",G45<>QCData!G45),\"C\",IF(AND(QCData!G45<>\"\",G45=\"\"),\"D\",\"no cd er\"))))","v":"S"},{"$f":"IF(H45=QCData!H45,\"S\",IF(AND(H45<>\"\",QCData!H45=\"\"),\"N\",IF(AND(H45<>\"\",QCData!H45<>\"\",H45<>QCData!H45),\"C\",IF(AND(QCData!H45<>\"\",H45=\"\"),\"D\",\"no cd er\"))))","v":"S"},{"$f":"IF(I45=QCData!I45,\"S\",IF(AND(I45<>\"\",QCData!I45=\"\"),\"N\",IF(AND(I45<>\"\",QCData!I45<>\"\",I45<>QCData!I45),\"C\",IF(AND(QCData!I45<>\"\",I45=\"\"),\"D\",\"no cd er\"))))","v":"N"},{"$f":"IF(J45=QCData!J45,\"S\",IF(AND(J45<>\"\",QCData!J45=\"\"),\"N\",IF(AND(J45<>\"\",QCData!J45<>\"\",J45<>QCData!J45),\"C\",IF(AND(QCData!J45<>\"\",J45=\"\"),\"D\",\"no cd er\"))))","v":"N"},{"$f":"IF(K45=QCData!K45,\"S\",IF(AND(K45<>\"\",QCData!K45=\"\"),\"N\",IF(AND(K45<>\"\",QCData!K45<>\"\",K45<>QCData!K45),\"C\",IF(AND(QCData!K45<>\"\",K45=\"\"),\"D\",\"no cd er\"))))","v":"N"},{"$f":"IF(L45=QCData!L45,\"S\",IF(AND(L45<>\"\",QCData!L45=\"\"),\"N\",IF(AND(L45<>\"\",QCData!L45<>\"\",L45<>QCData!L45),\"C\",IF(AND(QCData!L45<>\"\",L45=\"\"),\"D\",\"no cd er\"))))","v":"N"},{"$f":"IF(M45=QCData!M45,\"S\",IF(AND(M45<>\"\",QCData!M45=\"\"),\"N\",IF(AND(M45<>\"\",QCData!M45<>\"\",M45<>QCData!M45),\"C\",IF(AND(QCData!M45<>\"\",M45=\"\"),\"D\",\"no cd er\"))))","v":"N"},{"$f":"IF(N45=QCData!N45,\"S\",IF(AND(N45<>\"\",QCData!N45=\"\"),\"N\",IF(AND(N45<>\"\",QCData!N45<>\"\",N45<>QCData!N45),\"C\",IF(AND(QCData!N45<>\"\",N45=\"\"),\"D\",\"no cd er\"))))","v":"N"},{"$f":"IF(O45=QCData!O45,\"S\",IF(AND(O45<>\"\",QCData!O45=\"\"),\"N\",IF(AND(O45<>\"\",QCData!O45<>\"\",O45<>QCData!O45),\"C\",IF(AND(QCData!O45<>\"\",O45=\"\"),\"D\",\"no cd er\"))))","v":"N"},{"$f":"IF(P45=QCData!P45,\"S\",IF(AND(P45<>\"\",QCData!P45=\"\"),\"N\",IF(AND(P45<>\"\",QCData!P45<>\"\",P45<>QCData!P45),\"C\",IF(AND(QCData!P45<>\"\",P45=\"\"),\"D\",\"no cd er\"))))","v":"N"},{"$f":"IF(Q45=QCData!Q45,\"S\",IF(AND(Q45<>\"\",QCData!Q45=\"\"),\"N\",IF(AND(Q45<>\"\",QCData!Q45<>\"\",Q45<>QCData!Q45),\"C\",IF(AND(QCData!Q45<>\"\",Q45=\"\"),\"D\",\"no cd er\"))))","v":"S"},{"$f":"IF(R45=QCData!R45,\"S\",IF(AND(R45<>\"\",QCData!R45=\"\"),\"N\",IF(AND(R45<>\"\",QCData!R45<>\"\",R45<>QCData!R45),\"C\",IF(AND(QCData!R45<>\"\",R45=\"\"),\"D\",\"no cd er\"))))","v":"S"},{"$f":"IF(S45=QCData!S45,\"S\",IF(AND(S45<>\"\",QCData!S45=\"\"),\"N\",IF(AND(S45<>\"\",QCData!S45<>\"\",S45<>QCData!S45),\"C\",IF(AND(QCData!S45<>\"\",S45=\"\"),\"D\",\"no cd er\"))))","v":"N"},{"$f":"IF(T45=QCData!T45,\"S\",IF(AND(T45<>\"\",QCData!T45=\"\"),\"N\",IF(AND(T45<>\"\",QCData!T45<>\"\",T45<>QCData!T45),\"C\",IF(AND(QCData!T45<>\"\",T45=\"\"),\"D\",\"no cd er\"))))","v":"N"},{"$f":"IF(U45=QCData!U45,\"S\",IF(AND(U45<>\"\",QCData!U45=\"\"),\"N\",IF(AND(U45<>\"\",QCData!U45<>\"\",U45<>QCData!U45),\"C\",IF(AND(QCData!U45<>\"\",U45=\"\"),\"D\",\"no cd er\"))))","v":"N"},{"$f":"IF(V45=QCData!V45,\"S\",IF(AND(V45<>\"\",QCData!V45=\"\"),\"N\",IF(AND(V45<>\"\",QCData!V45<>\"\",V45<>QCData!V45),\"C\",IF(AND(QCData!V45<>\"\",V45=\"\"),\"D\",\"no cd er\"))))","v":"N"},{"$f":"IF(W45=QCData!W45,\"S\",IF(AND(W45<>\"\",QCData!W45=\"\"),\"N\",IF(AND(W45<>\"\",QCData!W45<>\"\",W45<>QCData!W45),\"C\",IF(AND(QCData!W45<>\"\",W45=\"\"),\"D\",\"no cd er\"))))","v":"N"},{"$f":"IF(X45=QCData!X45,\"S\",IF(AND(X45<>\"\",QCData!X45=\"\"),\"N\",IF(AND(X45<>\"\",QCData!X45<>\"\",X45<>QCData!X45),\"C\",IF(AND(QCData!X45<>\"\",X45=\"\"),\"D\",\"no cd er\"))))","v":"S"},{"$f":"IF(Y45=QCData!Y45,\"S\",IF(AND(Y45<>\"\",QCData!Y45=\"\"),\"N\",IF(AND(Y45<>\"\",QCData!Y45<>\"\",Y45<>QCData!Y45),\"C\",IF(AND(QCData!Y45<>\"\",Y45=\"\"),\"D\",\"no cd er\"))))","v":"S"},{"$f":"IF(Z45=QCData!Z45,\"S\",IF(AND(Z45<>\"\",QCData!Z45=\"\"),\"N\",IF(AND(Z45<>\"\",QCData!Z45<>\"\",Z45<>QCData!Z45),\"C\",IF(AND(QCData!Z45<>\"\",Z45=\"\"),\"D\",\"no cd er\"))))","v":"S"}]
[17,"",0,1,17,"NO","","",100,93,85,77,44,36,35,15,"","",6.5,5.05,93.4,92.1,92.1,3.2,3.3,3.4,null,null,null,null,null,null,null,null,null,null,null,null,null,null,null,null,null,null,null,null,null,null,null,null,null,null,17,null,0,1,17,"NO",null,null,100,93,85,77,44,36,35,15,null,null,6.5,5.05,93.4,92.1,92.1,3.2,3.3,3.4,null,null,null,null,null,null,null,null,null,null,null,null,null,null,null,null,null,null,null,null,null,null,null,null,null,null,null,null,null,null,null,null,null,null,null,null,null,null,null,null,null,null,null,null,null,null,null,null,null,null,null,null,null,null,null,null,null,null,null,null,null,null,null,null,null,null,null,null,null,null,null,null,null,null,null,null,null,null,{"$f":"IF(A46=QCData!A46,\"S\",IF(AND(A46<>\"\",QCData!A46=\"\"),\"N\",IF(AND(A46<>\"\",QCData!A46<>\"\",A46<>QCData!A46),\"C\",IF(AND(QCData!A46<>\"\",A46=\"\"),\"D\",\"no cd er\"))))","v":"N"},{"$f":"IF(B46=QCData!B46,\"S\",IF(AND(B46<>\"\",QCData!B46=\"\"),\"N\",IF(AND(B46<>\"\",QCData!B46<>\"\",B46<>QCData!B46),\"C\",IF(AND(QCData!B46<>\"\",B46=\"\"),\"D\",\"no cd er\"))))","v":"S"},{"$f":"IF(C46=QCData!C46,\"S\",IF(AND(C46<>\"\",QCData!C46=\"\"),\"N\",IF(AND(C46<>\"\",QCData!C46<>\"\",C46<>QCData!C46),\"C\",IF(AND(QCData!C46<>\"\",C46=\"\"),\"D\",\"no cd er\"))))","v":"S"},{"$f":"IF(D46=QCData!D46,\"S\",IF(AND(D46<>\"\",QCData!D46=\"\"),\"N\",IF(AND(D46<>\"\",QCData!D46<>\"\",D46<>QCData!D46),\"C\",IF(AND(QCData!D46<>\"\",D46=\"\"),\"D\",\"no cd er\"))))","v":"N"},{"$f":"IF(E46=QCData!E46,\"S\",IF(AND(E46<>\"\",QCData!E46=\"\"),\"N\",IF(AND(E46<>\"\",QCData!E46<>\"\",E46<>QCData!E46),\"C\",IF(AND(QCData!E46<>\"\",E46=\"\"),\"D\",\"no cd er\"))))","v":"N"},{"$f":"IF(F46=QCData!F46,\"S\",IF(AND(F46<>\"\",QCData!F46=\"\"),\"N\",IF(AND(F46<>\"\",QCData!F46<>\"\",F46<>QCData!F46),\"C\",IF(AND(QCData!F46<>\"\",F46=\"\"),\"D\",\"no cd er\"))))","v":"N"},{"$f":"IF(G46=QCData!G46,\"S\",IF(AND(G46<>\"\",QCData!G46=\"\"),\"N\",IF(AND(G46<>\"\",QCData!G46<>\"\",G46<>QCData!G46),\"C\",IF(AND(QCData!G46<>\"\",G46=\"\"),\"D\",\"no cd er\"))))","v":"S"},{"$f":"IF(H46=QCData!H46,\"S\",IF(AND(H46<>\"\",QCData!H46=\"\"),\"N\",IF(AND(H46<>\"\",QCData!H46<>\"\",H46<>QCData!H46),\"C\",IF(AND(QCData!H46<>\"\",H46=\"\"),\"D\",\"no cd er\"))))","v":"S"},{"$f":"IF(I46=QCData!I46,\"S\",IF(AND(I46<>\"\",QCData!I46=\"\"),\"N\",IF(AND(I46<>\"\",QCData!I46<>\"\",I46<>QCData!I46),\"C\",IF(AND(QCData!I46<>\"\",I46=\"\"),\"D\",\"no cd er\"))))","v":"N"},{"$f":"IF(J46=QCData!J46,\"S\",IF(AND(J46<>\"\",QCData!J46=\"\"),\"N\",IF(AND(J46<>\"\",QCData!J46<>\"\",J46<>QCData!J46),\"C\",IF(AND(QCData!J46<>\"\",J46=\"\"),\"D\",\"no cd er\"))))","v":"N"},{"$f":"IF(K46=QCData!K46,\"S\",IF(AND(K46<>\"\",QCData!K46=\"\"),\"N\",IF(AND(K46<>\"\",QCData!K46<>\"\",K46<>QCData!K46),\"C\",IF(AND(QCData!K46<>\"\",K46=\"\"),\"D\",\"no cd er\"))))","v":"N"},{"$f":"IF(L46=QCData!L46,\"S\",IF(AND(L46<>\"\",QCData!L46=\"\"),\"N\",IF(AND(L46<>\"\",QCData!L46<>\"\",L46<>QCData!L46),\"C\",IF(AND(QCData!L46<>\"\",L46=\"\"),\"D\",\"no cd er\"))))","v":"N"},{"$f":"IF(M46=QCData!M46,\"S\",IF(AND(M46<>\"\",QCData!M46=\"\"),\"N\",IF(AND(M46<>\"\",QCData!M46<>\"\",M46<>QCData!M46),\"C\",IF(AND(QCData!M46<>\"\",M46=\"\"),\"D\",\"no cd er\"))))","v":"N"},{"$f":"IF(N46=QCData!N46,\"S\",IF(AND(N46<>\"\",QCData!N46=\"\"),\"N\",IF(AND(N46<>\"\",QCData!N46<>\"\",N46<>QCData!N46),\"C\",IF(AND(QCData!N46<>\"\",N46=\"\"),\"D\",\"no cd er\"))))","v":"N"},{"$f":"IF(O46=QCData!O46,\"S\",IF(AND(O46<>\"\",QCData!O46=\"\"),\"N\",IF(AND(O46<>\"\",QCData!O46<>\"\",O46<>QCData!O46),\"C\",IF(AND(QCData!O46<>\"\",O46=\"\"),\"D\",\"no cd er\"))))","v":"N"},{"$f":"IF(P46=QCData!P46,\"S\",IF(AND(P46<>\"\",QCData!P46=\"\"),\"N\",IF(AND(P46<>\"\",QCData!P46<>\"\",P46<>QCData!P46),\"C\",IF(AND(QCData!P46<>\"\",P46=\"\"),\"D\",\"no cd er\"))))","v":"N"},{"$f":"IF(Q46=QCData!Q46,\"S\",IF(AND(Q46<>\"\",QCData!Q46=\"\"),\"N\",IF(AND(Q46<>\"\",QCData!Q46<>\"\",Q46<>QCData!Q46),\"C\",IF(AND(QCData!Q46<>\"\",Q46=\"\"),\"D\",\"no cd er\"))))","v":"S"},{"$f":"IF(R46=QCData!R46,\"S\",IF(AND(R46<>\"\",QCData!R46=\"\"),\"N\",IF(AND(R46<>\"\",QCData!R46<>\"\",R46<>QCData!R46),\"C\",IF(AND(QCData!R46<>\"\",R46=\"\"),\"D\",\"no cd er\"))))","v":"S"},{"$f":"IF(S46=QCData!S46,\"S\",IF(AND(S46<>\"\",QCData!S46=\"\"),\"N\",IF(AND(S46<>\"\",QCData!S46<>\"\",S46<>QCData!S46),\"C\",IF(AND(QCData!S46<>\"\",S46=\"\"),\"D\",\"no cd er\"))))","v":"N"},{"$f":"IF(T46=QCData!T46,\"S\",IF(AND(T46<>\"\",QCData!T46=\"\"),\"N\",IF(AND(T46<>\"\",QCData!T46<>\"\",T46<>QCData!T46),\"C\",IF(AND(QCData!T46<>\"\",T46=\"\"),\"D\",\"no cd er\"))))","v":"N"},{"$f":"IF(U46=QCData!U46,\"S\",IF(AND(U46<>\"\",QCData!U46=\"\"),\"N\",IF(AND(U46<>\"\",QCData!U46<>\"\",U46<>QCData!U46),\"C\",IF(AND(QCData!U46<>\"\",U46=\"\"),\"D\",\"no cd er\"))))","v":"N"},{"$f":"IF(V46=QCData!V46,\"S\",IF(AND(V46<>\"\",QCData!V46=\"\"),\"N\",IF(AND(V46<>\"\",QCData!V46<>\"\",V46<>QCData!V46),\"C\",IF(AND(QCData!V46<>\"\",V46=\"\"),\"D\",\"no cd er\"))))","v":"N"},{"$f":"IF(W46=QCData!W46,\"S\",IF(AND(W46<>\"\",QCData!W46=\"\"),\"N\",IF(AND(W46<>\"\",QCData!W46<>\"\",W46<>QCData!W46),\"C\",IF(AND(QCData!W46<>\"\",W46=\"\"),\"D\",\"no cd er\"))))","v":"N"},{"$f":"IF(X46=QCData!X46,\"S\",IF(AND(X46<>\"\",QCData!X46=\"\"),\"N\",IF(AND(X46<>\"\",QCData!X46<>\"\",X46<>QCData!X46),\"C\",IF(AND(QCData!X46<>\"\",X46=\"\"),\"D\",\"no cd er\"))))","v":"N"},{"$f":"IF(Y46=QCData!Y46,\"S\",IF(AND(Y46<>\"\",QCData!Y46=\"\"),\"N\",IF(AND(Y46<>\"\",QCData!Y46<>\"\",Y46<>QCData!Y46),\"C\",IF(AND(QCData!Y46<>\"\",Y46=\"\"),\"D\",\"no cd er\"))))","v":"N"},{"$f":"IF(Z46=QCData!Z46,\"S\",IF(AND(Z46<>\"\",QCData!Z46=\"\"),\"N\",IF(AND(Z46<>\"\",QCData!Z46<>\"\",Z46<>QCData!Z46),\"C\",IF(AND(QCData!Z46<>\"\",Z46=\"\"),\"D\",\"no cd er\"))))","v":"N"}]
[18,"",0,1,18,"NO","","",100,90,84,71,46,37,36,14,"","",6.6,5.03,92,95,96,"","","",null,null,null,null,null,null,null,null,null,null,null,null,null,null,null,null,null,null,null,null,null,null,null,null,null,null,18,null,0,1,18,"NO",null,null,100,90,84,71,46,37,36,14,null,null,6.6,5.03,92,95,96,null,null,null,null,null,null,null,null,null,null,null,null,null,null,null,null,null,null,null,null,null,null,null,null,null,null,null,null,null,null,null,null,null,null,null,null,null,null,null,null,null,null,null,null,null,null,null,null,null,null,null,null,null,null,null,null,null,null,null,null,null,null,null,null,null,null,null,null,null,null,null,null,null,null,null,null,null,null,null,null,null,{"$f":"IF(A47=QCData!A47,\"S\",IF(AND(A47<>\"\",QCData!A47=\"\"),\"N\",IF(AND(A47<>\"\",QCData!A47<>\"\",A47<>QCData!A47),\"C\",IF(AND(QCData!A47<>\"\",A47=\"\"),\"D\",\"no cd er\"))))","v":"N"},{"$f":"IF(B47=QCData!B47,\"S\",IF(AND(B47<>\"\",QCData!B47=\"\"),\"N\",IF(AND(B47<>\"\",QCData!B47<>\"\",B47<>QCData!B47),\"C\",IF(AND(QCData!B47<>\"\",B47=\"\"),\"D\",\"no cd er\"))))","v":"S"},{"$f":"IF(C47=QCData!C47,\"S\",IF(AND(C47<>\"\",QCData!C47=\"\"),\"N\",IF(AND(C47<>\"\",QCData!C47<>\"\",C47<>QCData!C47),\"C\",IF(AND(QCData!C47<>\"\",C47=\"\"),\"D\",\"no cd er\"))))","v":"S"},{"$f":"IF(D47=QCData!D47,\"S\",IF(AND(D47<>\"\",QCData!D47=\"\"),\"N\",IF(AND(D47<>\"\",QCData!D47<>\"\",D47<>QCData!D47),\"C\",IF(AND(QCData!D47<>\"\",D47=\"\"),\"D\",\"no cd er\"))))","v":"N"},{"$f":"IF(E47=QCData!E47,\"S\",IF(AND(E47<>\"\",QCData!E47=\"\"),\"N\",IF(AND(E47<>\"\",QCData!E47<>\"\",E47<>QCData!E47),\"C\",IF(AND(QCData!E47<>\"\",E47=\"\"),\"D\",\"no cd er\"))))","v":"N"},{"$f":"IF(F47=QCData!F47,\"S\",IF(AND(F47<>\"\",QCData!F47=\"\"),\"N\",IF(AND(F47<>\"\",QCData!F47<>\"\",F47<>QCData!F47),\"C\",IF(AND(QCData!F47<>\"\",F47=\"\"),\"D\",\"no cd er\"))))","v":"N"},{"$f":"IF(G47=QCData!G47,\"S\",IF(AND(G47<>\"\",QCData!G47=\"\"),\"N\",IF(AND(G47<>\"\",QCData!G47<>\"\",G47<>QCData!G47),\"C\",IF(AND(QCData!G47<>\"\",G47=\"\"),\"D\",\"no cd er\"))))","v":"S"},{"$f":"IF(H47=QCData!H47,\"S\",IF(AND(H47<>\"\",QCData!H47=\"\"),\"N\",IF(AND(H47<>\"\",QCData!H47<>\"\",H47<>QCData!H47),\"C\",IF(AND(QCData!H47<>\"\",H47=\"\"),\"D\",\"no cd er\"))))","v":"S"},{"$f":"IF(I47=QCData!I47,\"S\",IF(AND(I47<>\"\",QCData!I47=\"\"),\"N\",IF(AND(I47<>\"\",QCData!I47<>\"\",I47<>QCData!I47),\"C\",IF(AND(QCData!I47<>\"\",I47=\"\"),\"D\",\"no cd er\"))))","v":"N"},{"$f":"IF(J47=QCData!J47,\"S\",IF(AND(J47<>\"\",QCData!J47=\"\"),\"N\",IF(AND(J47<>\"\",QCData!J47<>\"\",J47<>QCData!J47),\"C\",IF(AND(QCData!J47<>\"\",J47=\"\"),\"D\",\"no cd er\"))))","v":"N"},{"$f":"IF(K47=QCData!K47,\"S\",IF(AND(K47<>\"\",QCData!K47=\"\"),\"N\",IF(AND(K47<>\"\",QCData!K47<>\"\",K47<>QCData!K47),\"C\",IF(AND(QCData!K47<>\"\",K47=\"\"),\"D\",\"no cd er\"))))","v":"N"},{"$f":"IF(L47=QCData!L47,\"S\",IF(AND(L47<>\"\",QCData!L47=\"\"),\"N\",IF(AND(L47<>\"\",QCData!L47<>\"\",L47<>QCData!L47),\"C\",IF(AND(QCData!L47<>\"\",L47=\"\"),\"D\",\"no cd er\"))))","v":"N"},{"$f":"IF(M47=QCData!M47,\"S\",IF(AND(M47<>\"\",QCData!M47=\"\"),\"N\",IF(AND(M47<>\"\",QCData!M47<>\"\",M47<>QCData!M47),\"C\",IF(AND(QCData!M47<>\"\",M47=\"\"),\"D\",\"no cd er\"))))","v":"N"},{"$f":"IF(N47=QCData!N47,\"S\",IF(AND(N47<>\"\",QCData!N47=\"\"),\"N\",IF(AND(N47<>\"\",QCData!N47<>\"\",N47<>QCData!N47),\"C\",IF(AND(QCData!N47<>\"\",N47=\"\"),\"D\",\"no cd er\"))))","v":"N"},{"$f":"IF(O47=QCData!O47,\"S\",IF(AND(O47<>\"\",QCData!O47=\"\"),\"N\",IF(AND(O47<>\"\",QCData!O47<>\"\",O47<>QCData!O47),\"C\",IF(AND(QCData!O47<>\"\",O47=\"\"),\"D\",\"no cd er\"))))","v":"N"},{"$f":"IF(P47=QCData!P47,\"S\",IF(AND(P47<>\"\",QCData!P47=\"\"),\"N\",IF(AND(P47<>\"\",QCData!P47<>\"\",P47<>QCData!P47),\"C\",IF(AND(QCData!P47<>\"\",P47=\"\"),\"D\",\"no cd er\"))))","v":"N"},{"$f":"IF(Q47=QCData!Q47,\"S\",IF(AND(Q47<>\"\",QCData!Q47=\"\"),\"N\",IF(AND(Q47<>\"\",QCData!Q47<>\"\",Q47<>QCData!Q47),\"C\",IF(AND(QCData!Q47<>\"\",Q47=\"\"),\"D\",\"no cd er\"))))","v":"S"},{"$f":"IF(R47=QCData!R47,\"S\",IF(AND(R47<>\"\",QCData!R47=\"\"),\"N\",IF(AND(R47<>\"\",QCData!R47<>\"\",R47<>QCData!R47),\"C\",IF(AND(QCData!R47<>\"\",R47=\"\"),\"D\",\"no cd er\"))))","v":"S"},{"$f":"IF(S47=QCData!S47,\"S\",IF(AND(S47<>\"\",QCData!S47=\"\"),\"N\",IF(AND(S47<>\"\",QCData!S47<>\"\",S47<>QCData!S47),\"C\",IF(AND(QCData!S47<>\"\",S47=\"\"),\"D\",\"no cd er\"))))","v":"N"},{"$f":"IF(T47=QCData!T47,\"S\",IF(AND(T47<>\"\",QCData!T47=\"\"),\"N\",IF(AND(T47<>\"\",QCData!T47<>\"\",T47<>QCData!T47),\"C\",IF(AND(QCData!T47<>\"\",T47=\"\"),\"D\",\"no cd er\"))))","v":"N"},{"$f":"IF(U47=QCData!U47,\"S\",IF(AND(U47<>\"\",QCData!U47=\"\"),\"N\",IF(AND(U47<>\"\",QCData!U47<>\"\",U47<>QCData!U47),\"C\",IF(AND(QCData!U47<>\"\",U47=\"\"),\"D\",\"no cd er\"))))","v":"N"},{"$f":"IF(V47=QCData!V47,\"S\",IF(AND(V47<>\"\",QCData!V47=\"\"),\"N\",IF(AND(V47<>\"\",QCData!V47<>\"\",V47<>QCData!V47),\"C\",IF(AND(QCData!V47<>\"\",V47=\"\"),\"D\",\"no cd er\"))))","v":"N"},{"$f":"IF(W47=QCData!W47,\"S\",IF(AND(W47<>\"\",QCData!W47=\"\"),\"N\",IF(AND(W47<>\"\",QCData!W47<>\"\",W47<>QCData!W47),\"C\",IF(AND(QCData!W47<>\"\",W47=\"\"),\"D\",\"no cd er\"))))","v":"N"},{"$f":"IF(X47=QCData!X47,\"S\",IF(AND(X47<>\"\",QCData!X47=\"\"),\"N\",IF(AND(X47<>\"\",QCData!X47<>\"\",X47<>QCData!X47),\"C\",IF(AND(QCData!X47<>\"\",X47=\"\"),\"D\",\"no cd er\"))))","v":"S"},{"$f":"IF(Y47=QCData!Y47,\"S\",IF(AND(Y47<>\"\",QCData!Y47=\"\"),\"N\",IF(AND(Y47<>\"\",QCData!Y47<>\"\",Y47<>QCData!Y47),\"C\",IF(AND(QCData!Y47<>\"\",Y47=\"\"),\"D\",\"no cd er\"))))","v":"S"},{"$f":"IF(Z47=QCData!Z47,\"S\",IF(AND(Z47<>\"\",QCData!Z47=\"\"),\"N\",IF(AND(Z47<>\"\",QCData!Z47<>\"\",Z47<>QCData!Z47),\"C\",IF(AND(QCData!Z47<>\"\",Z47=\"\"),\"D\",\"no cd er\"))))","v":"S"}]
[19,"2009-08-30",0,1,19,"NO","","",100,89,84,75,45,38,22,13,"","",7,5.15,93.1,94.1,95.1,3,2.9,2.8,null,null,null,null,null,null,null,null,null,null,null,null,null,null,null,null,null,null,null,null,null,null,null,null,null,null,19,40055,0,1,19,"NO",null,null,100,89,84,75,45,38,22,13,null,null,7,5.15,93.1,94.1,95.1,3,2.9,2.8,null,null,null,null,null,null,null,null,null,null,null,null,null,null,null,null,null,null,null,null,null,null,null,null,null,null,null,null,null,null,null,null,null,null,null,null,null,null,null,null,null,null,null,null,null,null,null,null,null,null,null,null,null,null,null,null,null,null,null,null,null,null,null,null,null,null,null,null,null,null,null,null,null,null,null,null,null,null,{"$f":"IF(A48=QCData!A48,\"S\",IF(AND(A48<>\"\",QCData!A48=\"\"),\"N\",IF(AND(A48<>\"\",QCData!A48<>\"\",A48<>QCData!A48),\"C\",IF(AND(QCData!A48<>\"\",A48=\"\"),\"D\",\"no cd er\"))))","v":"N"},{"$f":"IF(B48=QCData!B48,\"S\",IF(AND(B48<>\"\",QCData!B48=\"\"),\"N\",IF(AND(B48<>\"\",QCData!B48<>\"\",B48<>QCData!B48),\"C\",IF(AND(QCData!B48<>\"\",B48=\"\"),\"D\",\"no cd er\"))))","v":"N"},{"$f":"IF(C48=QCData!C48,\"S\",IF(AND(C48<>\"\",QCData!C48=\"\"),\"N\",IF(AND(C48<>\"\",QCData!C48<>\"\",C48<>QCData!C48),\"C\",IF(AND(QCData!C48<>\"\",C48=\"\"),\"D\",\"no cd er\"))))","v":"S"},{"$f":"IF(D48=QCData!D48,\"S\",IF(AND(D48<>\"\",QCData!D48=\"\"),\"N\",IF(AND(D48<>\"\",QCData!D48<>\"\",D48<>QCData!D48),\"C\",IF(AND(QCData!D48<>\"\",D48=\"\"),\"D\",\"no cd er\"))))","v":"N"},{"$f":"IF(E48=QCData!E48,\"S\",IF(AND(E48<>\"\",QCData!E48=\"\"),\"N\",IF(AND(E48<>\"\",QCData!E48<>\"\",E48<>QCData!E48),\"C\",IF(AND(QCData!E48<>\"\",E48=\"\"),\"D\",\"no cd er\"))))","v":"N"},{"$f":"IF(F48=QCData!F48,\"S\",IF(AND(F48<>\"\",QCData!F48=\"\"),\"N\",IF(AND(F48<>\"\",QCData!F48<>\"\",F48<>QCData!F48),\"C\",IF(AND(QCData!F48<>\"\",F48=\"\"),\"D\",\"no cd er\"))))","v":"N"},{"$f":"IF(G48=QCData!G48,\"S\",IF(AND(G48<>\"\",QCData!G48=\"\"),\"N\",IF(AND(G48<>\"\",QCData!G48<>\"\",G48<>QCData!G48),\"C\",IF(AND(QCData!G48<>\"\",G48=\"\"),\"D\",\"no cd er\"))))","v":"S"},{"$f":"IF(H48=QCData!H48,\"S\",IF(AND(H48<>\"\",QCData!H48=\"\"),\"N\",IF(AND(H48<>\"\",QCData!H48<>\"\",H48<>QCData!H48),\"C\",IF(AND(QCData!H48<>\"\",H48=\"\"),\"D\",\"no cd er\"))))","v":"S"},{"$f":"IF(I48=QCData!I48,\"S\",IF(AND(I48<>\"\",QCData!I48=\"\"),\"N\",IF(AND(I48<>\"\",QCData!I48<>\"\",I48<>QCData!I48),\"C\",IF(AND(QCData!I48<>\"\",I48=\"\"),\"D\",\"no cd er\"))))","v":"N"},{"$f":"IF(J48=QCData!J48,\"S\",IF(AND(J48<>\"\",QCData!J48=\"\"),\"N\",IF(AND(J48<>\"\",QCData!J48<>\"\",J48<>QCData!J48),\"C\",IF(AND(QCData!J48<>\"\",J48=\"\"),\"D\",\"no cd er\"))))","v":"N"},{"$f":"IF(K48=QCData!K48,\"S\",IF(AND(K48<>\"\",QCData!K48=\"\"),\"N\",IF(AND(K48<>\"\",QCData!K48<>\"\",K48<>QCData!K48),\"C\",IF(AND(QCData!K48<>\"\",K48=\"\"),\"D\",\"no cd er\"))))","v":"N"},{"$f":"IF(L48=QCData!L48,\"S\",IF(AND(L48<>\"\",QCData!L48=\"\"),\"N\",IF(AND(L48<>\"\",QCData!L48<>\"\",L48<>QCData!L48),\"C\",IF(AND(QCData!L48<>\"\",L48=\"\"),\"D\",\"no cd er\"))))","v":"N"},{"$f":"IF(M48=QCData!M48,\"S\",IF(AND(M48<>\"\",QCData!M48=\"\"),\"N\",IF(AND(M48<>\"\",QCData!M48<>\"\",M48<>QCData!M48),\"C\",IF(AND(QCData!M48<>\"\",M48=\"\"),\"D\",\"no cd er\"))))","v":"N"},{"$f":"IF(N48=QCData!N48,\"S\",IF(AND(N48<>\"\",QCData!N48=\"\"),\"N\",IF(AND(N48<>\"\",QCData!N48<>\"\",N48<>QCData!N48),\"C\",IF(AND(QCData!N48<>\"\",N48=\"\"),\"D\",\"no cd er\"))))","v":"N"},{"$f":"IF(O48=QCData!O48,\"S\",IF(AND(O48<>\"\",QCData!O48=\"\"),\"N\",IF(AND(O48<>\"\",QCData!O48<>\"\",O48<>QCData!O48),\"C\",IF(AND(QCData!O48<>\"\",O48=\"\"),\"D\",\"no cd er\"))))","v":"N"},{"$f":"IF(P48=QCData!P48,\"S\",IF(AND(P48<>\"\",QCData!P48=\"\"),\"N\",IF(AND(P48<>\"\",QCData!P48<>\"\",P48<>QCData!P48),\"C\",IF(AND(QCData!P48<>\"\",P48=\"\"),\"D\",\"no cd er\"))))","v":"N"},{"$f":"IF(Q48=QCData!Q48,\"S\",IF(AND(Q48<>\"\",QCData!Q48=\"\"),\"N\",IF(AND(Q48<>\"\",QCData!Q48<>\"\",Q48<>QCData!Q48),\"C\",IF(AND(QCData!Q48<>\"\",Q48=\"\"),\"D\",\"no cd er\"))))","v":"S"},{"$f":"IF(R48=QCData!R48,\"S\",IF(AND(R48<>\"\",QCData!R48=\"\"),\"N\",IF(AND(R48<>\"\",QCData!R48<>\"\",R48<>QCData!R48),\"C\",IF(AND(QCData!R48<>\"\",R48=\"\"),\"D\",\"no cd er\"))))","v":"S"},{"$f":"IF(S48=QCData!S48,\"S\",IF(AND(S48<>\"\",QCData!S48=\"\"),\"N\",IF(AND(S48<>\"\",QCData!S48<>\"\",S48<>QCData!S48),\"C\",IF(AND(QCData!S48<>\"\",S48=\"\"),\"D\",\"no cd er\"))))","v":"N"},{"$f":"IF(T48=QCData!T48,\"S\",IF(AND(T48<>\"\",QCData!T48=\"\"),\"N\",IF(AND(T48<>\"\",QCData!T48<>\"\",T48<>QCData!T48),\"C\",IF(AND(QCData!T48<>\"\",T48=\"\"),\"D\",\"no cd er\"))))","v":"N"},{"$f":"IF(U48=QCData!U48,\"S\",IF(AND(U48<>\"\",QCData!U48=\"\"),\"N\",IF(AND(U48<>\"\",QCData!U48<>\"\",U48<>QCData!U48),\"C\",IF(AND(QCData!U48<>\"\",U48=\"\"),\"D\",\"no cd er\"))))","v":"N"},{"$f":"IF(V48=QCData!V48,\"S\",IF(AND(V48<>\"\",QCData!V48=\"\"),\"N\",IF(AND(V48<>\"\",QCData!V48<>\"\",V48<>QCData!V48),\"C\",IF(AND(QCData!V48<>\"\",V48=\"\"),\"D\",\"no cd er\"))))","v":"N"},{"$f":"IF(W48=QCData!W48,\"S\",IF(AND(W48<>\"\",QCData!W48=\"\"),\"N\",IF(AND(W48<>\"\",QCData!W48<>\"\",W48<>QCData!W48),\"C\",IF(AND(QCData!W48<>\"\",W48=\"\"),\"D\",\"no cd er\"))))","v":"N"},{"$f":"IF(X48=QCData!X48,\"S\",IF(AND(X48<>\"\",QCData!X48=\"\"),\"N\",IF(AND(X48<>\"\",QCData!X48<>\"\",X48<>QCData!X48),\"C\",IF(AND(QCData!X48<>\"\",X48=\"\"),\"D\",\"no cd er\"))))","v":"N"},{"$f":"IF(Y48=QCData!Y48,\"S\",IF(AND(Y48<>\"\",QCData!Y48=\"\"),\"N\",IF(AND(Y48<>\"\",QCData!Y48<>\"\",Y48<>QCData!Y48),\"C\",IF(AND(QCData!Y48<>\"\",Y48=\"\"),\"D\",\"no cd er\"))))","v":"N"},{"$f":"IF(Z48=QCData!Z48,\"S\",IF(AND(Z48<>\"\",QCData!Z48=\"\"),\"N\",IF(AND(Z48<>\"\",QCData!Z48<>\"\",Z48<>QCData!Z48),\"C\",IF(AND(QCData!Z48<>\"\",Z48=\"\"),\"D\",\"no cd er\"))))","v":"N"}]
[20,"",0,1,20,"NO","","",100,90,84,75,48,32,29,12,"","",5.2,4.8,93.4,92.1,92.1,"","","",null,null,null,null,null,null,null,null,null,null,null,null,null,null,null,null,null,null,null,null,null,null,null,null,null,null,20,null,0,1,20,"NO",null,null,100,90,84,75,48,32,29,12,null,null,5.2,4.8,93.4,92.1,92.1,null,null,null,null,null,null,null,null,null,null,null,null,null,null,null,null,null,null,null,null,null,null,null,null,null,null,null,null,null,null,null,null,null,null,null,null,null,null,null,null,null,null,null,null,null,null,null,null,null,null,null,null,null,null,null,null,null,null,null,null,null,null,null,null,null,null,null,null,null,null,null,null,null,null,null,null,null,null,null,null,null,{"$f":"IF(A49=QCData!A49,\"S\",IF(AND(A49<>\"\",QCData!A49=\"\"),\"N\",IF(AND(A49<>\"\",QCData!A49<>\"\",A49<>QCData!A49),\"C\",IF(AND(QCData!A49<>\"\",A49=\"\"),\"D\",\"no cd er\"))))","v":"N"},{"$f":"IF(B49=QCData!B49,\"S\",IF(AND(B49<>\"\",QCData!B49=\"\"),\"N\",IF(AND(B49<>\"\",QCData!B49<>\"\",B49<>QCData!B49),\"C\",IF(AND(QCData!B49<>\"\",B49=\"\"),\"D\",\"no cd er\"))))","v":"S"},{"$f":"IF(C49=QCData!C49,\"S\",IF(AND(C49<>\"\",QCData!C49=\"\"),\"N\",IF(AND(C49<>\"\",QCData!C49<>\"\",C49<>QCData!C49),\"C\",IF(AND(QCData!C49<>\"\",C49=\"\"),\"D\",\"no cd er\"))))","v":"S"},{"$f":"IF(D49=QCData!D49,\"S\",IF(AND(D49<>\"\",QCData!D49=\"\"),\"N\",IF(AND(D49<>\"\",QCData!D49<>\"\",D49<>QCData!D49),\"C\",IF(AND(QCData!D49<>\"\",D49=\"\"),\"D\",\"no cd er\"))))","v":"N"},{"$f":"IF(E49=QCData!E49,\"S\",IF(AND(E49<>\"\",QCData!E49=\"\"),\"N\",IF(AND(E49<>\"\",QCData!E49<>\"\",E49<>QCData!E49),\"C\",IF(AND(QCData!E49<>\"\",E49=\"\"),\"D\",\"no cd er\"))))","v":"N"},{"$f":"IF(F49=QCData!F49,\"S\",IF(AND(F49<>\"\",QCData!F49=\"\"),\"N\",IF(AND(F49<>\"\",QCData!F49<>\"\",F49<>QCData!F49),\"C\",IF(AND(QCData!F49<>\"\",F49=\"\"),\"D\",\"no cd er\"))))","v":"N"},{"$f":"IF(G49=QCData!G49,\"S\",IF(AND(G49<>\"\",QCData!G49=\"\"),\"N\",IF(AND(G49<>\"\",QCData!G49<>\"\",G49<>QCData!G49),\"C\",IF(AND(QCData!G49<>\"\",G49=\"\"),\"D\",\"no cd er\"))))","v":"S"},{"$f":"IF(H49=QCData!H49,\"S\",IF(AND(H49<>\"\",QCData!H49=\"\"),\"N\",IF(AND(H49<>\"\",QCData!H49<>\"\",H49<>QCData!H49),\"C\",IF(AND(QCData!H49<>\"\",H49=\"\"),\"D\",\"no cd er\"))))","v":"S"},{"$f":"IF(I49=QCData!I49,\"S\",IF(AND(I49<>\"\",QCData!I49=\"\"),\"N\",IF(AND(I49<>\"\",QCData!I49<>\"\",I49<>QCData!I49),\"C\",IF(AND(QCData!I49<>\"\",I49=\"\"),\"D\",\"no cd er\"))))","v":"N"},{"$f":"IF(J49=QCData!J49,\"S\",IF(AND(J49<>\"\",QCData!J49=\"\"),\"N\",IF(AND(J49<>\"\",QCData!J49<>\"\",J49<>QCData!J49),\"C\",IF(AND(QCData!J49<>\"\",J49=\"\"),\"D\",\"no cd er\"))))","v":"N"},{"$f":"IF(K49=QCData!K49,\"S\",IF(AND(K49<>\"\",QCData!K49=\"\"),\"N\",IF(AND(K49<>\"\",QCData!K49<>\"\",K49<>QCData!K49),\"C\",IF(AND(QCData!K49<>\"\",K49=\"\"),\"D\",\"no cd er\"))))","v":"N"},{"$f":"IF(L49=QCData!L49,\"S\",IF(AND(L49<>\"\",QCData!L49=\"\"),\"N\",IF(AND(L49<>\"\",QCData!L49<>\"\",L49<>QCData!L49),\"C\",IF(AND(QCData!L49<>\"\",L49=\"\"),\"D\",\"no cd er\"))))","v":"N"},{"$f":"IF(M49=QCData!M49,\"S\",IF(AND(M49<>\"\",QCData!M49=\"\"),\"N\",IF(AND(M49<>\"\",QCData!M49<>\"\",M49<>QCData!M49),\"C\",IF(AND(QCData!M49<>\"\",M49=\"\"),\"D\",\"no cd er\"))))","v":"N"},{"$f":"IF(N49=QCData!N49,\"S\",IF(AND(N49<>\"\",QCData!N49=\"\"),\"N\",IF(AND(N49<>\"\",QCData!N49<>\"\",N49<>QCData!N49),\"C\",IF(AND(QCData!N49<>\"\",N49=\"\"),\"D\",\"no cd er\"))))","v":"N"},{"$f":"IF(O49=QCData!O49,\"S\",IF(AND(O49<>\"\",QCData!O49=\"\"),\"N\",IF(AND(O49<>\"\",QCData!O49<>\"\",O49<>QCData!O49),\"C\",IF(AND(QCData!O49<>\"\",O49=\"\"),\"D\",\"no cd er\"))))","v":"N"},{"$f":"IF(P49=QCData!P49,\"S\",IF(AND(P49<>\"\",QCData!P49=\"\"),\"N\",IF(AND(P49<>\"\",QCData!P49<>\"\",P49<>QCData!P49),\"C\",IF(AND(QCData!P49<>\"\",P49=\"\"),\"D\",\"no cd er\"))))","v":"N"},{"$f":"IF(Q49=QCData!Q49,\"S\",IF(AND(Q49<>\"\",QCData!Q49=\"\"),\"N\",IF(AND(Q49<>\"\",QCData!Q49<>\"\",Q49<>QCData!Q49),\"C\",IF(AND(QCData!Q49<>\"\",Q49=\"\"),\"D\",\"no cd er\"))))","v":"S"},{"$f":"IF(R49=QCData!R49,\"S\",IF(AND(R49<>\"\",QCData!R49=\"\"),\"N\",IF(AND(R49<>\"\",QCData!R49<>\"\",R49<>QCData!R49),\"C\",IF(AND(QCData!R49<>\"\",R49=\"\"),\"D\",\"no cd er\"))))","v":"S"},{"$f":"IF(S49=QCData!S49,\"S\",IF(AND(S49<>\"\",QCData!S49=\"\"),\"N\",IF(AND(S49<>\"\",QCData!S49<>\"\",S49<>QCData!S49),\"C\",IF(AND(QCData!S49<>\"\",S49=\"\"),\"D\",\"no cd er\"))))","v":"N"},{"$f":"IF(T49=QCData!T49,\"S\",IF(AND(T49<>\"\",QCData!T49=\"\"),\"N\",IF(AND(T49<>\"\",QCData!T49<>\"\",T49<>QCData!T49),\"C\",IF(AND(QCData!T49<>\"\",T49=\"\"),\"D\",\"no cd er\"))))","v":"N"},{"$f":"IF(U49=QCData!U49,\"S\",IF(AND(U49<>\"\",QCData!U49=\"\"),\"N\",IF(AND(U49<>\"\",QCData!U49<>\"\",U49<>QCData!U49),\"C\",IF(AND(QCData!U49<>\"\",U49=\"\"),\"D\",\"no cd er\"))))","v":"N"},{"$f":"IF(V49=QCData!V49,\"S\",IF(AND(V49<>\"\",QCData!V49=\"\"),\"N\",IF(AND(V49<>\"\",QCData!V49<>\"\",V49<>QCData!V49),\"C\",IF(AND(QCData!V49<>\"\",V49=\"\"),\"D\",\"no cd er\"))))","v":"N"},{"$f":"IF(W49=QCData!W49,\"S\",IF(AND(W49<>\"\",QCData!W49=\"\"),\"N\",IF(AND(W49<>\"\",QCData!W49<>\"\",W49<>QCData!W49),\"C\",IF(AND(QCData!W49<>\"\",W49=\"\"),\"D\",\"no cd er\"))))","v":"N"},{"$f":"IF(X49=QCData!X49,\"S\",IF(AND(X49<>\"\",QCData!X49=\"\"),\"N\",IF(AND(X49<>\"\",QCData!X49<>\"\",X49<>QCData!X49),\"C\",IF(AND(QCData!X49<>\"\",X49=\"\"),\"D\",\"no cd er\"))))","v":"S"},{"$f":"IF(Y49=QCData!Y49,\"S\",IF(AND(Y49<>\"\",QCData!Y49=\"\"),\"N\",IF(AND(Y49<>\"\",QCData!Y49<>\"\",Y49<>QCData!Y49),\"C\",IF(AND(QCData!Y49<>\"\",Y49=\"\"),\"D\",\"no cd er\"))))","v":"S"},{"$f":"IF(Z49=QCData!Z49,\"S\",IF(AND(Z49<>\"\",QCData!Z49=\"\"),\"N\",IF(AND(Z49<>\"\",QCData!Z49<>\"\",Z49<>QCData!Z49),\"C\",IF(AND(QCData!Z49<>\"\",Z49=\"\"),\"D\",\"no cd er\"))))","v":"S"}]
[21,"",0,1,21,"NO","","",100,92,85,75,42,41,23,10,"","",7.3,4.7,93.4,92.1,92.1,2.2000000000000002,2.2999999999999998,2.2999999999999998,null,null,null,null,null,null,null,null,null,null,null,null,null,null,null,null,null,null,null,null,null,null,null,null,null,null,21,null,0,1,21,"NO",null,null,100,92,85,75,42,41,23,10,null,null,7.3,4.7,93.4,92.1,92.1,2.2000000000000002,2.2999999999999998,2.2999999999999998,null,null,null,null,null,null,null,null,null,null,null,null,null,null,null,null,null,null,null,null,null,null,null,null,null,null,null,null,null,null,null,null,null,null,null,null,null,null,null,null,null,null,null,null,null,null,null,null,null,null,null,null,null,null,null,null,null,null,null,null,null,null,null,null,null,null,null,null,null,null,null,null,null,null,null,null,null,null,{"$f":"IF(A50=QCData!A50,\"S\",IF(AND(A50<>\"\",QCData!A50=\"\"),\"N\",IF(AND(A50<>\"\",QCData!A50<>\"\",A50<>QCData!A50),\"C\",IF(AND(QCData!A50<>\"\",A50=\"\"),\"D\",\"no cd er\"))))","v":"N"},{"$f":"IF(B50=QCData!B50,\"S\",IF(AND(B50<>\"\",QCData!B50=\"\"),\"N\",IF(AND(B50<>\"\",QCData!B50<>\"\",B50<>QCData!B50),\"C\",IF(AND(QCData!B50<>\"\",B50=\"\"),\"D\",\"no cd er\"))))","v":"S"},{"$f":"IF(C50=QCData!C50,\"S\",IF(AND(C50<>\"\",QCData!C50=\"\"),\"N\",IF(AND(C50<>\"\",QCData!C50<>\"\",C50<>QCData!C50),\"C\",IF(AND(QCData!C50<>\"\",C50=\"\"),\"D\",\"no cd er\"))))","v":"S"},{"$f":"IF(D50=QCData!D50,\"S\",IF(AND(D50<>\"\",QCData!D50=\"\"),\"N\",IF(AND(D50<>\"\",QCData!D50<>\"\",D50<>QCData!D50),\"C\",IF(AND(QCData!D50<>\"\",D50=\"\"),\"D\",\"no cd er\"))))","v":"N"},{"$f":"IF(E50=QCData!E50,\"S\",IF(AND(E50<>\"\",QCData!E50=\"\"),\"N\",IF(AND(E50<>\"\",QCData!E50<>\"\",E50<>QCData!E50),\"C\",IF(AND(QCData!E50<>\"\",E50=\"\"),\"D\",\"no cd er\"))))","v":"N"},{"$f":"IF(F50=QCData!F50,\"S\",IF(AND(F50<>\"\",QCData!F50=\"\"),\"N\",IF(AND(F50<>\"\",QCData!F50<>\"\",F50<>QCData!F50),\"C\",IF(AND(QCData!F50<>\"\",F50=\"\"),\"D\",\"no cd er\"))))","v":"N"},{"$f":"IF(G50=QCData!G50,\"S\",IF(AND(G50<>\"\",QCData!G50=\"\"),\"N\",IF(AND(G50<>\"\",QCData!G50<>\"\",G50<>QCData!G50),\"C\",IF(AND(QCData!G50<>\"\",G50=\"\"),\"D\",\"no cd er\"))))","v":"S"},{"$f":"IF(H50=QCData!H50,\"S\",IF(AND(H50<>\"\",QCData!H50=\"\"),\"N\",IF(AND(H50<>\"\",QCData!H50<>\"\",H50<>QCData!H50),\"C\",IF(AND(QCData!H50<>\"\",H50=\"\"),\"D\",\"no cd er\"))))","v":"S"},{"$f":"IF(I50=QCData!I50,\"S\",IF(AND(I50<>\"\",QCData!I50=\"\"),\"N\",IF(AND(I50<>\"\",QCData!I50<>\"\",I50<>QCData!I50),\"C\",IF(AND(QCData!I50<>\"\",I50=\"\"),\"D\",\"no cd er\"))))","v":"N"},{"$f":"IF(J50=QCData!J50,\"S\",IF(AND(J50<>\"\",QCData!J50=\"\"),\"N\",IF(AND(J50<>\"\",QCData!J50<>\"\",J50<>QCData!J50),\"C\",IF(AND(QCData!J50<>\"\",J50=\"\"),\"D\",\"no cd er\"))))","v":"N"},{"$f":"IF(K50=QCData!K50,\"S\",IF(AND(K50<>\"\",QCData!K50=\"\"),\"N\",IF(AND(K50<>\"\",QCData!K50<>\"\",K50<>QCData!K50),\"C\",IF(AND(QCData!K50<>\"\",K50=\"\"),\"D\",\"no cd er\"))))","v":"N"},{"$f":"IF(L50=QCData!L50,\"S\",IF(AND(L50<>\"\",QCData!L50=\"\"),\"N\",IF(AND(L50<>\"\",QCData!L50<>\"\",L50<>QCData!L50),\"C\",IF(AND(QCData!L50<>\"\",L50=\"\"),\"D\",\"no cd er\"))))","v":"N"},{"$f":"IF(M50=QCData!M50,\"S\",IF(AND(M50<>\"\",QCData!M50=\"\"),\"N\",IF(AND(M50<>\"\",QCData!M50<>\"\",M50<>QCData!M50),\"C\",IF(AND(QCData!M50<>\"\",M50=\"\"),\"D\",\"no cd er\"))))","v":"N"},{"$f":"IF(N50=QCData!N50,\"S\",IF(AND(N50<>\"\",QCData!N50=\"\"),\"N\",IF(AND(N50<>\"\",QCData!N50<>\"\",N50<>QCData!N50),\"C\",IF(AND(QCData!N50<>\"\",N50=\"\"),\"D\",\"no cd er\"))))","v":"N"},{"$f":"IF(O50=QCData!O50,\"S\",IF(AND(O50<>\"\",QCData!O50=\"\"),\"N\",IF(AND(O50<>\"\",QCData!O50<>\"\",O50<>QCData!O50),\"C\",IF(AND(QCData!O50<>\"\",O50=\"\"),\"D\",\"no cd er\"))))","v":"N"},{"$f":"IF(P50=QCData!P50,\"S\",IF(AND(P50<>\"\",QCData!P50=\"\"),\"N\",IF(AND(P50<>\"\",QCData!P50<>\"\",P50<>QCData!P50),\"C\",IF(AND(QCData!P50<>\"\",P50=\"\"),\"D\",\"no cd er\"))))","v":"N"},{"$f":"IF(Q50=QCData!Q50,\"S\",IF(AND(Q50<>\"\",QCData!Q50=\"\"),\"N\",IF(AND(Q50<>\"\",QCData!Q50<>\"\",Q50<>QCData!Q50),\"C\",IF(AND(QCData!Q50<>\"\",Q50=\"\"),\"D\",\"no cd er\"))))","v":"S"},{"$f":"IF(R50=QCData!R50,\"S\",IF(AND(R50<>\"\",QCData!R50=\"\"),\"N\",IF(AND(R50<>\"\",QCData!R50<>\"\",R50<>QCData!R50),\"C\",IF(AND(QCData!R50<>\"\",R50=\"\"),\"D\",\"no cd er\"))))","v":"S"},{"$f":"IF(S50=QCData!S50,\"S\",IF(AND(S50<>\"\",QCData!S50=\"\"),\"N\",IF(AND(S50<>\"\",QCData!S50<>\"\",S50<>QCData!S50),\"C\",IF(AND(QCData!S50<>\"\",S50=\"\"),\"D\",\"no cd er\"))))","v":"N"},{"$f":"IF(T50=QCData!T50,\"S\",IF(AND(T50<>\"\",QCData!T50=\"\"),\"N\",IF(AND(T50<>\"\",QCData!T50<>\"\",T50<>QCData!T50),\"C\",IF(AND(QCData!T50<>\"\",T50=\"\"),\"D\",\"no cd er\"))))","v":"N"},{"$f":"IF(U50=QCData!U50,\"S\",IF(AND(U50<>\"\",QCData!U50=\"\"),\"N\",IF(AND(U50<>\"\",QCData!U50<>\"\",U50<>QCData!U50),\"C\",IF(AND(QCData!U50<>\"\",U50=\"\"),\"D\",\"no cd er\"))))","v":"N"},{"$f":"IF(V50=QCData!V50,\"S\",IF(AND(V50<>\"\",QCData!V50=\"\"),\"N\",IF(AND(V50<>\"\",QCData!V50<>\"\",V50<>QCData!V50),\"C\",IF(AND(QCData!V50<>\"\",V50=\"\"),\"D\",\"no cd er\"))))","v":"N"},{"$f":"IF(W50=QCData!W50,\"S\",IF(AND(W50<>\"\",QCData!W50=\"\"),\"N\",IF(AND(W50<>\"\",QCData!W50<>\"\",W50<>QCData!W50),\"C\",IF(AND(QCData!W50<>\"\",W50=\"\"),\"D\",\"no cd er\"))))","v":"N"},{"$f":"IF(X50=QCData!X50,\"S\",IF(AND(X50<>\"\",QCData!X50=\"\"),\"N\",IF(AND(X50<>\"\",QCData!X50<>\"\",X50<>QCData!X50),\"C\",IF(AND(QCData!X50<>\"\",X50=\"\"),\"D\",\"no cd er\"))))","v":"N"},{"$f":"IF(Y50=QCData!Y50,\"S\",IF(AND(Y50<>\"\",QCData!Y50=\"\"),\"N\",IF(AND(Y50<>\"\",QCData!Y50<>\"\",Y50<>QCData!Y50),\"C\",IF(AND(QCData!Y50<>\"\",Y50=\"\"),\"D\",\"no cd er\"))))","v":"N"},{"$f":"IF(Z50=QCData!Z50,\"S\",IF(AND(Z50<>\"\",QCData!Z50=\"\"),\"N\",IF(AND(Z50<>\"\",QCData!Z50<>\"\",Z50<>QCData!Z50),\"C\",IF(AND(QCData!Z50<>\"\",Z50=\"\"),\"D\",\"no cd er\"))))","v":"N"}]
[22,"",0,1,22,"NO","","",100,90,75,75,48,40,35,12,"","",7.1,4.5999999999999996,97,98,99,"","","",null,null,null,null,null,null,null,null,null,null,null,null,null,null,null,null,null,null,null,null,null,null,null,null,null,null,22,null,0,1,22,"NO",null,null,100,90,75,75,48,40,35,12,null,null,7.1,4.5999999999999996,97,98,99,null,null,null,null,null,null,null,null,null,null,null,null,null,null,null,null,null,null,null,null,null,null,null,null,null,null,null,null,null,null,null,null,null,null,null,null,null,null,null,null,null,null,null,null,null,null,null,null,null,null,null,null,null,null,null,null,null,null,null,null,null,null,null,null,null,null,null,null,null,null,null,null,null,null,null,null,null,null,null,null,null,{"$f":"IF(A51=QCData!A51,\"S\",IF(AND(A51<>\"\",QCData!A51=\"\"),\"N\",IF(AND(A51<>\"\",QCData!A51<>\"\",A51<>QCData!A51),\"C\",IF(AND(QCData!A51<>\"\",A51=\"\"),\"D\",\"no cd er\"))))","v":"N"},{"$f":"IF(B51=QCData!B51,\"S\",IF(AND(B51<>\"\",QCData!B51=\"\"),\"N\",IF(AND(B51<>\"\",QCData!B51<>\"\",B51<>QCData!B51),\"C\",IF(AND(QCData!B51<>\"\",B51=\"\"),\"D\",\"no cd er\"))))","v":"S"},{"$f":"IF(C51=QCData!C51,\"S\",IF(AND(C51<>\"\",QCData!C51=\"\"),\"N\",IF(AND(C51<>\"\",QCData!C51<>\"\",C51<>QCData!C51),\"C\",IF(AND(QCData!C51<>\"\",C51=\"\"),\"D\",\"no cd er\"))))","v":"S"},{"$f":"IF(D51=QCData!D51,\"S\",IF(AND(D51<>\"\",QCData!D51=\"\"),\"N\",IF(AND(D51<>\"\",QCData!D51<>\"\",D51<>QCData!D51),\"C\",IF(AND(QCData!D51<>\"\",D51=\"\"),\"D\",\"no cd er\"))))","v":"N"},{"$f":"IF(E51=QCData!E51,\"S\",IF(AND(E51<>\"\",QCData!E51=\"\"),\"N\",IF(AND(E51<>\"\",QCData!E51<>\"\",E51<>QCData!E51),\"C\",IF(AND(QCData!E51<>\"\",E51=\"\"),\"D\",\"no cd er\"))))","v":"N"},{"$f":"IF(F51=QCData!F51,\"S\",IF(AND(F51<>\"\",QCData!F51=\"\"),\"N\",IF(AND(F51<>\"\",QCData!F51<>\"\",F51<>QCData!F51),\"C\",IF(AND(QCData!F51<>\"\",F51=\"\"),\"D\",\"no cd er\"))))","v":"N"},{"$f":"IF(G51=QCData!G51,\"S\",IF(AND(G51<>\"\",QCData!G51=\"\"),\"N\",IF(AND(G51<>\"\",QCData!G51<>\"\",G51<>QCData!G51),\"C\",IF(AND(QCData!G51<>\"\",G51=\"\"),\"D\",\"no cd er\"))))","v":"S"},{"$f":"IF(H51=QCData!H51,\"S\",IF(AND(H51<>\"\",QCData!H51=\"\"),\"N\",IF(AND(H51<>\"\",QCData!H51<>\"\",H51<>QCData!H51),\"C\",IF(AND(QCData!H51<>\"\",H51=\"\"),\"D\",\"no cd er\"))))","v":"S"},{"$f":"IF(I51=QCData!I51,\"S\",IF(AND(I51<>\"\",QCData!I51=\"\"),\"N\",IF(AND(I51<>\"\",QCData!I51<>\"\",I51<>QCData!I51),\"C\",IF(AND(QCData!I51<>\"\",I51=\"\"),\"D\",\"no cd er\"))))","v":"N"},{"$f":"IF(J51=QCData!J51,\"S\",IF(AND(J51<>\"\",QCData!J51=\"\"),\"N\",IF(AND(J51<>\"\",QCData!J51<>\"\",J51<>QCData!J51),\"C\",IF(AND(QCData!J51<>\"\",J51=\"\"),\"D\",\"no cd er\"))))","v":"N"},{"$f":"IF(K51=QCData!K51,\"S\",IF(AND(K51<>\"\",QCData!K51=\"\"),\"N\",IF(AND(K51<>\"\",QCData!K51<>\"\",K51<>QCData!K51),\"C\",IF(AND(QCData!K51<>\"\",K51=\"\"),\"D\",\"no cd er\"))))","v":"N"},{"$f":"IF(L51=QCData!L51,\"S\",IF(AND(L51<>\"\",QCData!L51=\"\"),\"N\",IF(AND(L51<>\"\",QCData!L51<>\"\",L51<>QCData!L51),\"C\",IF(AND(QCData!L51<>\"\",L51=\"\"),\"D\",\"no cd er\"))))","v":"N"},{"$f":"IF(M51=QCData!M51,\"S\",IF(AND(M51<>\"\",QCData!M51=\"\"),\"N\",IF(AND(M51<>\"\",QCData!M51<>\"\",M51<>QCData!M51),\"C\",IF(AND(QCData!M51<>\"\",M51=\"\"),\"D\",\"no cd er\"))))","v":"N"},{"$f":"IF(N51=QCData!N51,\"S\",IF(AND(N51<>\"\",QCData!N51=\"\"),\"N\",IF(AND(N51<>\"\",QCData!N51<>\"\",N51<>QCData!N51),\"C\",IF(AND(QCData!N51<>\"\",N51=\"\"),\"D\",\"no cd er\"))))","v":"N"},{"$f":"IF(O51=QCData!O51,\"S\",IF(AND(O51<>\"\",QCData!O51=\"\"),\"N\",IF(AND(O51<>\"\",QCData!O51<>\"\",O51<>QCData!O51),\"C\",IF(AND(QCData!O51<>\"\",O51=\"\"),\"D\",\"no cd er\"))))","v":"N"},{"$f":"IF(P51=QCData!P51,\"S\",IF(AND(P51<>\"\",QCData!P51=\"\"),\"N\",IF(AND(P51<>\"\",QCData!P51<>\"\",P51<>QCData!P51),\"C\",IF(AND(QCData!P51<>\"\",P51=\"\"),\"D\",\"no cd er\"))))","v":"N"},{"$f":"IF(Q51=QCData!Q51,\"S\",IF(AND(Q51<>\"\",QCData!Q51=\"\"),\"N\",IF(AND(Q51<>\"\",QCData!Q51<>\"\",Q51<>QCData!Q51),\"C\",IF(AND(QCData!Q51<>\"\",Q51=\"\"),\"D\",\"no cd er\"))))","v":"S"},{"$f":"IF(R51=QCData!R51,\"S\",IF(AND(R51<>\"\",QCData!R51=\"\"),\"N\",IF(AND(R51<>\"\",QCData!R51<>\"\",R51<>QCData!R51),\"C\",IF(AND(QCData!R51<>\"\",R51=\"\"),\"D\",\"no cd er\"))))","v":"S"},{"$f":"IF(S51=QCData!S51,\"S\",IF(AND(S51<>\"\",QCData!S51=\"\"),\"N\",IF(AND(S51<>\"\",QCData!S51<>\"\",S51<>QCData!S51),\"C\",IF(AND(QCData!S51<>\"\",S51=\"\"),\"D\",\"no cd er\"))))","v":"N"},{"$f":"IF(T51=QCData!T51,\"S\",IF(AND(T51<>\"\",QCData!T51=\"\"),\"N\",IF(AND(T51<>\"\",QCData!T51<>\"\",T51<>QCData!T51),\"C\",IF(AND(QCData!T51<>\"\",T51=\"\"),\"D\",\"no cd er\"))))","v":"N"},{"$f":"IF(U51=QCData!U51,\"S\",IF(AND(U51<>\"\",QCData!U51=\"\"),\"N\",IF(AND(U51<>\"\",QCData!U51<>\"\",U51<>QCData!U51),\"C\",IF(AND(QCData!U51<>\"\",U51=\"\"),\"D\",\"no cd er\"))))","v":"N"},{"$f":"IF(V51=QCData!V51,\"S\",IF(AND(V51<>\"\",QCData!V51=\"\"),\"N\",IF(AND(V51<>\"\",QCData!V51<>\"\",V51<>QCData!V51),\"C\",IF(AND(QCData!V51<>\"\",V51=\"\"),\"D\",\"no cd er\"))))","v":"N"},{"$f":"IF(W51=QCData!W51,\"S\",IF(AND(W51<>\"\",QCData!W51=\"\"),\"N\",IF(AND(W51<>\"\",QCData!W51<>\"\",W51<>QCData!W51),\"C\",IF(AND(QCData!W51<>\"\",W51=\"\"),\"D\",\"no cd er\"))))","v":"N"},{"$f":"IF(X51=QCData!X51,\"S\",IF(AND(X51<>\"\",QCData!X51=\"\"),\"N\",IF(AND(X51<>\"\",QCData!X51<>\"\",X51<>QCData!X51),\"C\",IF(AND(QCData!X51<>\"\",X51=\"\"),\"D\",\"no cd er\"))))","v":"S"},{"$f":"IF(Y51=QCData!Y51,\"S\",IF(AND(Y51<>\"\",QCData!Y51=\"\"),\"N\",IF(AND(Y51<>\"\",QCData!Y51<>\"\",Y51<>QCData!Y51),\"C\",IF(AND(QCData!Y51<>\"\",Y51=\"\"),\"D\",\"no cd er\"))))","v":"S"},{"$f":"IF(Z51=QCData!Z51,\"S\",IF(AND(Z51<>\"\",QCData!Z51=\"\"),\"N\",IF(AND(Z51<>\"\",QCData!Z51<>\"\",Z51<>QCData!Z51),\"C\",IF(AND(QCData!Z51<>\"\",Z51=\"\"),\"D\",\"no cd er\"))))","v":"S"}]
[23,"2009-09-01",555,1,23,"NO","","",100,89,73,75,52,31,36,11,"","",6.9,4.5,96,96,97,"","","",null,null,null,null,null,null,null,null,null,null,null,null,null,null,null,null,null,null,null,null,null,null,null,null,null,null,23,40057,555,1,23,"NO",null,null,100,89,73,75,52,31,36,11,null,null,6.9,4.5,96,96,97,null,null,null,null,null,null,null,null,null,null,null,null,null,null,null,null,null,null,null,null,null,null,null,null,null,null,null,null,null,null,null,null,null,null,null,null,null,null,null,null,null,null,null,null,null,null,null,null,null,null,null,null,null,null,null,null,null,null,null,null,null,null,null,null,null,null,null,null,null,null,null,null,null,null,null,null,null,null,null,null,null,{"$f":"IF(A52=QCData!A52,\"S\",IF(AND(A52<>\"\",QCData!A52=\"\"),\"N\",IF(AND(A52<>\"\",QCData!A52<>\"\",A52<>QCData!A52),\"C\",IF(AND(QCData!A52<>\"\",A52=\"\"),\"D\",\"no cd er\"))))","v":"N"},{"$f":"IF(B52=QCData!B52,\"S\",IF(AND(B52<>\"\",QCData!B52=\"\"),\"N\",IF(AND(B52<>\"\",QCData!B52<>\"\",B52<>QCData!B52),\"C\",IF(AND(QCData!B52<>\"\",B52=\"\"),\"D\",\"no cd er\"))))","v":"N"},{"$f":"IF(C52=QCData!C52,\"S\",IF(AND(C52<>\"\",QCData!C52=\"\"),\"N\",IF(AND(C52<>\"\",QCData!C52<>\"\",C52<>QCData!C52),\"C\",IF(AND(QCData!C52<>\"\",C52=\"\"),\"D\",\"no cd er\"))))","v":"N"},{"$f":"IF(D52=QCData!D52,\"S\",IF(AND(D52<>\"\",QCData!D52=\"\"),\"N\",IF(AND(D52<>\"\",QCData!D52<>\"\",D52<>QCData!D52),\"C\",IF(AND(QCData!D52<>\"\",D52=\"\"),\"D\",\"no cd er\"))))","v":"N"},{"$f":"IF(E52=QCData!E52,\"S\",IF(AND(E52<>\"\",QCData!E52=\"\"),\"N\",IF(AND(E52<>\"\",QCData!E52<>\"\",E52<>QCData!E52),\"C\",IF(AND(QCData!E52<>\"\",E52=\"\"),\"D\",\"no cd er\"))))","v":"N"},{"$f":"IF(F52=QCData!F52,\"S\",IF(AND(F52<>\"\",QCData!F52=\"\"),\"N\",IF(AND(F52<>\"\",QCData!F52<>\"\",F52<>QCData!F52),\"C\",IF(AND(QCData!F52<>\"\",F52=\"\"),\"D\",\"no cd er\"))))","v":"N"},{"$f":"IF(G52=QCData!G52,\"S\",IF(AND(G52<>\"\",QCData!G52=\"\"),\"N\",IF(AND(G52<>\"\",QCData!G52<>\"\",G52<>QCData!G52),\"C\",IF(AND(QCData!G52<>\"\",G52=\"\"),\"D\",\"no cd er\"))))","v":"S"},{"$f":"IF(H52=QCData!H52,\"S\",IF(AND(H52<>\"\",QCData!H52=\"\"),\"N\",IF(AND(H52<>\"\",QCData!H52<>\"\",H52<>QCData!H52),\"C\",IF(AND(QCData!H52<>\"\",H52=\"\"),\"D\",\"no cd er\"))))","v":"S"},{"$f":"IF(I52=QCData!I52,\"S\",IF(AND(I52<>\"\",QCData!I52=\"\"),\"N\",IF(AND(I52<>\"\",QCData!I52<>\"\",I52<>QCData!I52),\"C\",IF(AND(QCData!I52<>\"\",I52=\"\"),\"D\",\"no cd er\"))))","v":"N"},{"$f":"IF(J52=QCData!J52,\"S\",IF(AND(J52<>\"\",QCData!J52=\"\"),\"N\",IF(AND(J52<>\"\",QCData!J52<>\"\",J52<>QCData!J52),\"C\",IF(AND(QCData!J52<>\"\",J52=\"\"),\"D\",\"no cd er\"))))","v":"N"},{"$f":"IF(K52=QCData!K52,\"S\",IF(AND(K52<>\"\",QCData!K52=\"\"),\"N\",IF(AND(K52<>\"\",QCData!K52<>\"\",K52<>QCData!K52),\"C\",IF(AND(QCData!K52<>\"\",K52=\"\"),\"D\",\"no cd er\"))))","v":"N"},{"$f":"IF(L52=QCData!L52,\"S\",IF(AND(L52<>\"\",QCData!L52=\"\"),\"N\",IF(AND(L52<>\"\",QCData!L52<>\"\",L52<>QCData!L52),\"C\",IF(AND(QCData!L52<>\"\",L52=\"\"),\"D\",\"no cd er\"))))","v":"N"},{"$f":"IF(M52=QCData!M52,\"S\",IF(AND(M52<>\"\",QCData!M52=\"\"),\"N\",IF(AND(M52<>\"\",QCData!M52<>\"\",M52<>QCData!M52),\"C\",IF(AND(QCData!M52<>\"\",M52=\"\"),\"D\",\"no cd er\"))))","v":"N"},{"$f":"IF(N52=QCData!N52,\"S\",IF(AND(N52<>\"\",QCData!N52=\"\"),\"N\",IF(AND(N52<>\"\",QCData!N52<>\"\",N52<>QCData!N52),\"C\",IF(AND(QCData!N52<>\"\",N52=\"\"),\"D\",\"no cd er\"))))","v":"N"},{"$f":"IF(O52=QCData!O52,\"S\",IF(AND(O52<>\"\",QCData!O52=\"\"),\"N\",IF(AND(O52<>\"\",QCData!O52<>\"\",O52<>QCData!O52),\"C\",IF(AND(QCData!O52<>\"\",O52=\"\"),\"D\",\"no cd er\"))))","v":"N"},{"$f":"IF(P52=QCData!P52,\"S\",IF(AND(P52<>\"\",QCData!P52=\"\"),\"N\",IF(AND(P52<>\"\",QCData!P52<>\"\",P52<>QCData!P52),\"C\",IF(AND(QCData!P52<>\"\",P52=\"\"),\"D\",\"no cd er\"))))","v":"N"},{"$f":"IF(Q52=QCData!Q52,\"S\",IF(AND(Q52<>\"\",QCData!Q52=\"\"),\"N\",IF(AND(Q52<>\"\",QCData!Q52<>\"\",Q52<>QCData!Q52),\"C\",IF(AND(QCData!Q52<>\"\",Q52=\"\"),\"D\",\"no cd er\"))))","v":"S"},{"$f":"IF(R52=QCData!R52,\"S\",IF(AND(R52<>\"\",QCData!R52=\"\"),\"N\",IF(AND(R52<>\"\",QCData!R52<>\"\",R52<>QCData!R52),\"C\",IF(AND(QCData!R52<>\"\",R52=\"\"),\"D\",\"no cd er\"))))","v":"S"},{"$f":"IF(S52=QCData!S52,\"S\",IF(AND(S52<>\"\",QCData!S52=\"\"),\"N\",IF(AND(S52<>\"\",QCData!S52<>\"\",S52<>QCData!S52),\"C\",IF(AND(QCData!S52<>\"\",S52=\"\"),\"D\",\"no cd er\"))))","v":"N"},{"$f":"IF(T52=QCData!T52,\"S\",IF(AND(T52<>\"\",QCData!T52=\"\"),\"N\",IF(AND(T52<>\"\",QCData!T52<>\"\",T52<>QCData!T52),\"C\",IF(AND(QCData!T52<>\"\",T52=\"\"),\"D\",\"no cd er\"))))","v":"N"},{"$f":"IF(U52=QCData!U52,\"S\",IF(AND(U52<>\"\",QCData!U52=\"\"),\"N\",IF(AND(U52<>\"\",QCData!U52<>\"\",U52<>QCData!U52),\"C\",IF(AND(QCData!U52<>\"\",U52=\"\"),\"D\",\"no cd er\"))))","v":"N"},{"$f":"IF(V52=QCData!V52,\"S\",IF(AND(V52<>\"\",QCData!V52=\"\"),\"N\",IF(AND(V52<>\"\",QCData!V52<>\"\",V52<>QCData!V52),\"C\",IF(AND(QCData!V52<>\"\",V52=\"\"),\"D\",\"no cd er\"))))","v":"N"},{"$f":"IF(W52=QCData!W52,\"S\",IF(AND(W52<>\"\",QCData!W52=\"\"),\"N\",IF(AND(W52<>\"\",QCData!W52<>\"\",W52<>QCData!W52),\"C\",IF(AND(QCData!W52<>\"\",W52=\"\"),\"D\",\"no cd er\"))))","v":"N"},{"$f":"IF(X52=QCData!X52,\"S\",IF(AND(X52<>\"\",QCData!X52=\"\"),\"N\",IF(AND(X52<>\"\",QCData!X52<>\"\",X52<>QCData!X52),\"C\",IF(AND(QCData!X52<>\"\",X52=\"\"),\"D\",\"no cd er\"))))","v":"S"},{"$f":"IF(Y52=QCData!Y52,\"S\",IF(AND(Y52<>\"\",QCData!Y52=\"\"),\"N\",IF(AND(Y52<>\"\",QCData!Y52<>\"\",Y52<>QCData!Y52),\"C\",IF(AND(QCData!Y52<>\"\",Y52=\"\"),\"D\",\"no cd er\"))))","v":"S"},{"$f":"IF(Z52=QCData!Z52,\"S\",IF(AND(Z52<>\"\",QCData!Z52=\"\"),\"N\",IF(AND(Z52<>\"\",QCData!Z52<>\"\",Z52<>QCData!Z52),\"C\",IF(AND(QCData!Z52<>\"\",Z52=\"\"),\"D\",\"no cd er\"))))","v":"S"}]
[24,"",0,1,24,"NO","","",100,92,72,75,48,32,22,10,"","",7.3,5,97,97.8,98.1,"","","",null,null,null,null,null,null,null,null,null,null,null,null,null,null,null,null,null,null,null,null,null,null,null,null,null,null,24,null,0,1,24,"NO",null,null,100,92,72,75,48,32,22,10,null,null,7.3,5,97,97.8,98.1,null,null,null,null,null,null,null,null,null,null,null,null,null,null,null,null,null,null,null,null,null,null,null,null,null,null,null,null,null,null,null,null,null,null,null,null,null,null,null,null,null,null,null,null,null,null,null,null,null,null,null,null,null,null,null,null,null,null,null,null,null,null,null,null,null,null,null,null,null,null,null,null,null,null,null,null,null,null,null,null,null,{"$f":"IF(A53=QCData!A53,\"S\",IF(AND(A53<>\"\",QCData!A53=\"\"),\"N\",IF(AND(A53<>\"\",QCData!A53<>\"\",A53<>QCData!A53),\"C\",IF(AND(QCData!A53<>\"\",A53=\"\"),\"D\",\"no cd er\"))))","v":"N"},{"$f":"IF(B53=QCData!B53,\"S\",IF(AND(B53<>\"\",QCData!B53=\"\"),\"N\",IF(AND(B53<>\"\",QCData!B53<>\"\",B53<>QCData!B53),\"C\",IF(AND(QCData!B53<>\"\",B53=\"\"),\"D\",\"no cd er\"))))","v":"S"},{"$f":"IF(C53=QCData!C53,\"S\",IF(AND(C53<>\"\",QCData!C53=\"\"),\"N\",IF(AND(C53<>\"\",QCData!C53<>\"\",C53<>QCData!C53),\"C\",IF(AND(QCData!C53<>\"\",C53=\"\"),\"D\",\"no cd er\"))))","v":"S"},{"$f":"IF(D53=QCData!D53,\"S\",IF(AND(D53<>\"\",QCData!D53=\"\"),\"N\",IF(AND(D53<>\"\",QCData!D53<>\"\",D53<>QCData!D53),\"C\",IF(AND(QCData!D53<>\"\",D53=\"\"),\"D\",\"no cd er\"))))","v":"N"},{"$f":"IF(E53=QCData!E53,\"S\",IF(AND(E53<>\"\",QCData!E53=\"\"),\"N\",IF(AND(E53<>\"\",QCData!E53<>\"\",E53<>QCData!E53),\"C\",IF(AND(QCData!E53<>\"\",E53=\"\"),\"D\",\"no cd er\"))))","v":"N"},{"$f":"IF(F53=QCData!F53,\"S\",IF(AND(F53<>\"\",QCData!F53=\"\"),\"N\",IF(AND(F53<>\"\",QCData!F53<>\"\",F53<>QCData!F53),\"C\",IF(AND(QCData!F53<>\"\",F53=\"\"),\"D\",\"no cd er\"))))","v":"N"},{"$f":"IF(G53=QCData!G53,\"S\",IF(AND(G53<>\"\",QCData!G53=\"\"),\"N\",IF(AND(G53<>\"\",QCData!G53<>\"\",G53<>QCData!G53),\"C\",IF(AND(QCData!G53<>\"\",G53=\"\"),\"D\",\"no cd er\"))))","v":"S"},{"$f":"IF(H53=QCData!H53,\"S\",IF(AND(H53<>\"\",QCData!H53=\"\"),\"N\",IF(AND(H53<>\"\",QCData!H53<>\"\",H53<>QCData!H53),\"C\",IF(AND(QCData!H53<>\"\",H53=\"\"),\"D\",\"no cd er\"))))","v":"S"},{"$f":"IF(I53=QCData!I53,\"S\",IF(AND(I53<>\"\",QCData!I53=\"\"),\"N\",IF(AND(I53<>\"\",QCData!I53<>\"\",I53<>QCData!I53),\"C\",IF(AND(QCData!I53<>\"\",I53=\"\"),\"D\",\"no cd er\"))))","v":"N"},{"$f":"IF(J53=QCData!J53,\"S\",IF(AND(J53<>\"\",QCData!J53=\"\"),\"N\",IF(AND(J53<>\"\",QCData!J53<>\"\",J53<>QCData!J53),\"C\",IF(AND(QCData!J53<>\"\",J53=\"\"),\"D\",\"no cd er\"))))","v":"N"},{"$f":"IF(K53=QCData!K53,\"S\",IF(AND(K53<>\"\",QCData!K53=\"\"),\"N\",IF(AND(K53<>\"\",QCData!K53<>\"\",K53<>QCData!K53),\"C\",IF(AND(QCData!K53<>\"\",K53=\"\"),\"D\",\"no cd er\"))))","v":"N"},{"$f":"IF(L53=QCData!L53,\"S\",IF(AND(L53<>\"\",QCData!L53=\"\"),\"N\",IF(AND(L53<>\"\",QCData!L53<>\"\",L53<>QCData!L53),\"C\",IF(AND(QCData!L53<>\"\",L53=\"\"),\"D\",\"no cd er\"))))","v":"N"},{"$f":"IF(M53=QCData!M53,\"S\",IF(AND(M53<>\"\",QCData!M53=\"\"),\"N\",IF(AND(M53<>\"\",QCData!M53<>\"\",M53<>QCData!M53),\"C\",IF(AND(QCData!M53<>\"\",M53=\"\"),\"D\",\"no cd er\"))))","v":"N"},{"$f":"IF(N53=QCData!N53,\"S\",IF(AND(N53<>\"\",QCData!N53=\"\"),\"N\",IF(AND(N53<>\"\",QCData!N53<>\"\",N53<>QCData!N53),\"C\",IF(AND(QCData!N53<>\"\",N53=\"\"),\"D\",\"no cd er\"))))","v":"N"},{"$f":"IF(O53=QCData!O53,\"S\",IF(AND(O53<>\"\",QCData!O53=\"\"),\"N\",IF(AND(O53<>\"\",QCData!O53<>\"\",O53<>QCData!O53),\"C\",IF(AND(QCData!O53<>\"\",O53=\"\"),\"D\",\"no cd er\"))))","v":"N"},{"$f":"IF(P53=QCData!P53,\"S\",IF(AND(P53<>\"\",QCData!P53=\"\"),\"N\",IF(AND(P53<>\"\",QCData!P53<>\"\",P53<>QCData!P53),\"C\",IF(AND(QCData!P53<>\"\",P53=\"\"),\"D\",\"no cd er\"))))","v":"N"},{"$f":"IF(Q53=QCData!Q53,\"S\",IF(AND(Q53<>\"\",QCData!Q53=\"\"),\"N\",IF(AND(Q53<>\"\",QCData!Q53<>\"\",Q53<>QCData!Q53),\"C\",IF(AND(QCData!Q53<>\"\",Q53=\"\"),\"D\",\"no cd er\"))))","v":"S"},{"$f":"IF(R53=QCData!R53,\"S\",IF(AND(R53<>\"\",QCData!R53=\"\"),\"N\",IF(AND(R53<>\"\",QCData!R53<>\"\",R53<>QCData!R53),\"C\",IF(AND(QCData!R53<>\"\",R53=\"\"),\"D\",\"no cd er\"))))","v":"S"},{"$f":"IF(S53=QCData!S53,\"S\",IF(AND(S53<>\"\",QCData!S53=\"\"),\"N\",IF(AND(S53<>\"\",QCData!S53<>\"\",S53<>QCData!S53),\"C\",IF(AND(QCData!S53<>\"\",S53=\"\"),\"D\",\"no cd er\"))))","v":"N"},{"$f":"IF(T53=QCData!T53,\"S\",IF(AND(T53<>\"\",QCData!T53=\"\"),\"N\",IF(AND(T53<>\"\",QCData!T53<>\"\",T53<>QCData!T53),\"C\",IF(AND(QCData!T53<>\"\",T53=\"\"),\"D\",\"no cd er\"))))","v":"N"},{"$f":"IF(U53=QCData!U53,\"S\",IF(AND(U53<>\"\",QCData!U53=\"\"),\"N\",IF(AND(U53<>\"\",QCData!U53<>\"\",U53<>QCData!U53),\"C\",IF(AND(QCData!U53<>\"\",U53=\"\"),\"D\",\"no cd er\"))))","v":"N"},{"$f":"IF(V53=QCData!V53,\"S\",IF(AND(V53<>\"\",QCData!V53=\"\"),\"N\",IF(AND(V53<>\"\",QCData!V53<>\"\",V53<>QCData!V53),\"C\",IF(AND(QCData!V53<>\"\",V53=\"\"),\"D\",\"no cd er\"))))","v":"N"},{"$f":"IF(W53=QCData!W53,\"S\",IF(AND(W53<>\"\",QCData!W53=\"\"),\"N\",IF(AND(W53<>\"\",QCData!W53<>\"\",W53<>QCData!W53),\"C\",IF(AND(QCData!W53<>\"\",W53=\"\"),\"D\",\"no cd er\"))))","v":"N"},{"$f":"IF(X53=QCData!X53,\"S\",IF(AND(X53<>\"\",QCData!X53=\"\"),\"N\",IF(AND(X53<>\"\",QCData!X53<>\"\",X53<>QCData!X53),\"C\",IF(AND(QCData!X53<>\"\",X53=\"\"),\"D\",\"no cd er\"))))","v":"S"},{"$f":"IF(Y53=QCData!Y53,\"S\",IF(AND(Y53<>\"\",QCData!Y53=\"\"),\"N\",IF(AND(Y53<>\"\",QCData!Y53<>\"\",Y53<>QCData!Y53),\"C\",IF(AND(QCData!Y53<>\"\",Y53=\"\"),\"D\",\"no cd er\"))))","v":"S"},{"$f":"IF(Z53=QCData!Z53,\"S\",IF(AND(Z53<>\"\",QCData!Z53=\"\"),\"N\",IF(AND(Z53<>\"\",QCData!Z53<>\"\",Z53<>QCData!Z53),\"C\",IF(AND(QCData!Z53<>\"\",Z53=\"\"),\"D\",\"no cd er\"))))","v":"S"}]
["","","","","","","","","","","","","","","","","","","","","","","","","","",null,null,null,null,null,null,null,null,null,null,null,null,null,null,null,null,null,null,null,null,null,null,null,null,null,null,null,null,null,null,null,null,null,null,null,null,null,null,null,null,null,null,null,null,null,null,null,null,null,null,null,null,null,null,null,null,null,null,null,null,null,null,null,null,null,null,null,null,null,null,null,null,null,null,null,null,null,null,null,null,null,null,null,null,null,null,null,null,null,null,null,null,null,null,null,null,null,null,null,null,null,null,null,null,null,null,null,null,null,null,null,null,null,null,null,null,null,null,null,null,null,null,null,null,null,null,null,null,null,null,{"$f":"IF(A54=QCData!A54,\"S\",IF(AND(A54<>\"\",QCData!A54=\"\"),\"N\",IF(AND(A54<>\"\",QCData!A54<>\"\",A54<>QCData!A54),\"C\",IF(AND(QCData!A54<>\"\",A54=\"\"),\"D\",\"no cd er\"))))","v":"S"},{"$f":"IF(B54=QCData!B54,\"S\",IF(AND(B54<>\"\",QCData!B54=\"\"),\"N\",IF(AND(B54<>\"\",QCData!B54<>\"\",B54<>QCData!B54),\"C\",IF(AND(QCData!B54<>\"\",B54=\"\"),\"D\",\"no cd er\"))))","v":"S"},{"$f":"IF(C54=QCData!C54,\"S\",IF(AND(C54<>\"\",QCData!C54=\"\"),\"N\",IF(AND(C54<>\"\",QCData!C54<>\"\",C54<>QCData!C54),\"C\",IF(AND(QCData!C54<>\"\",C54=\"\"),\"D\",\"no cd er\"))))","v":"S"},{"$f":"IF(D54=QCData!D54,\"S\",IF(AND(D54<>\"\",QCData!D54=\"\"),\"N\",IF(AND(D54<>\"\",QCData!D54<>\"\",D54<>QCData!D54),\"C\",IF(AND(QCData!D54<>\"\",D54=\"\"),\"D\",\"no cd er\"))))","v":"S"},{"$f":"IF(E54=QCData!E54,\"S\",IF(AND(E54<>\"\",QCData!E54=\"\"),\"N\",IF(AND(E54<>\"\",QCData!E54<>\"\",E54<>QCData!E54),\"C\",IF(AND(QCData!E54<>\"\",E54=\"\"),\"D\",\"no cd er\"))))","v":"S"},{"$f":"IF(F54=QCData!F54,\"S\",IF(AND(F54<>\"\",QCData!F54=\"\"),\"N\",IF(AND(F54<>\"\",QCData!F54<>\"\",F54<>QCData!F54),\"C\",IF(AND(QCData!F54<>\"\",F54=\"\"),\"D\",\"no cd er\"))))","v":"S"},{"$f":"IF(G54=QCData!G54,\"S\",IF(AND(G54<>\"\",QCData!G54=\"\"),\"N\",IF(AND(G54<>\"\",QCData!G54<>\"\",G54<>QCData!G54),\"C\",IF(AND(QCData!G54<>\"\",G54=\"\"),\"D\",\"no cd er\"))))","v":"S"},{"$f":"IF(H54=QCData!H54,\"S\",IF(AND(H54<>\"\",QCData!H54=\"\"),\"N\",IF(AND(H54<>\"\",QCData!H54<>\"\",H54<>QCData!H54),\"C\",IF(AND(QCData!H54<>\"\",H54=\"\"),\"D\",\"no cd er\"))))","v":"S"},{"$f":"IF(I54=QCData!I54,\"S\",IF(AND(I54<>\"\",QCData!I54=\"\"),\"N\",IF(AND(I54<>\"\",QCData!I54<>\"\",I54<>QCData!I54),\"C\",IF(AND(QCData!I54<>\"\",I54=\"\"),\"D\",\"no cd er\"))))","v":"S"},{"$f":"IF(J54=QCData!J54,\"S\",IF(AND(J54<>\"\",QCData!J54=\"\"),\"N\",IF(AND(J54<>\"\",QCData!J54<>\"\",J54<>QCData!J54),\"C\",IF(AND(QCData!J54<>\"\",J54=\"\"),\"D\",\"no cd er\"))))","v":"S"},{"$f":"IF(K54=QCData!K54,\"S\",IF(AND(K54<>\"\",QCData!K54=\"\"),\"N\",IF(AND(K54<>\"\",QCData!K54<>\"\",K54<>QCData!K54),\"C\",IF(AND(QCData!K54<>\"\",K54=\"\"),\"D\",\"no cd er\"))))","v":"S"},{"$f":"IF(L54=QCData!L54,\"S\",IF(AND(L54<>\"\",QCData!L54=\"\"),\"N\",IF(AND(L54<>\"\",QCData!L54<>\"\",L54<>QCData!L54),\"C\",IF(AND(QCData!L54<>\"\",L54=\"\"),\"D\",\"no cd er\"))))","v":"S"},{"$f":"IF(M54=QCData!M54,\"S\",IF(AND(M54<>\"\",QCData!M54=\"\"),\"N\",IF(AND(M54<>\"\",QCData!M54<>\"\",M54<>QCData!M54),\"C\",IF(AND(QCData!M54<>\"\",M54=\"\"),\"D\",\"no cd er\"))))","v":"S"},{"$f":"IF(N54=QCData!N54,\"S\",IF(AND(N54<>\"\",QCData!N54=\"\"),\"N\",IF(AND(N54<>\"\",QCData!N54<>\"\",N54<>QCData!N54),\"C\",IF(AND(QCData!N54<>\"\",N54=\"\"),\"D\",\"no cd er\"))))","v":"S"},{"$f":"IF(O54=QCData!O54,\"S\",IF(AND(O54<>\"\",QCData!O54=\"\"),\"N\",IF(AND(O54<>\"\",QCData!O54<>\"\",O54<>QCData!O54),\"C\",IF(AND(QCData!O54<>\"\",O54=\"\"),\"D\",\"no cd er\"))))","v":"S"},{"$f":"IF(P54=QCData!P54,\"S\",IF(AND(P54<>\"\",QCData!P54=\"\"),\"N\",IF(AND(P54<>\"\",QCData!P54<>\"\",P54<>QCData!P54),\"C\",IF(AND(QCData!P54<>\"\",P54=\"\"),\"D\",\"no cd er\"))))","v":"S"},{"$f":"IF(Q54=QCData!Q54,\"S\",IF(AND(Q54<>\"\",QCData!Q54=\"\"),\"N\",IF(AND(Q54<>\"\",QCData!Q54<>\"\",Q54<>QCData!Q54),\"C\",IF(AND(QCData!Q54<>\"\",Q54=\"\"),\"D\",\"no cd er\"))))","v":"S"},{"$f":"IF(R54=QCData!R54,\"S\",IF(AND(R54<>\"\",QCData!R54=\"\"),\"N\",IF(AND(R54<>\"\",QCData!R54<>\"\",R54<>QCData!R54),\"C\",IF(AND(QCData!R54<>\"\",R54=\"\"),\"D\",\"no cd er\"))))","v":"S"},{"$f":"IF(S54=QCData!S54,\"S\",IF(AND(S54<>\"\",QCData!S54=\"\"),\"N\",IF(AND(S54<>\"\",QCData!S54<>\"\",S54<>QCData!S54),\"C\",IF(AND(QCData!S54<>\"\",S54=\"\"),\"D\",\"no cd er\"))))","v":"S"},{"$f":"IF(T54=QCData!T54,\"S\",IF(AND(T54<>\"\",QCData!T54=\"\"),\"N\",IF(AND(T54<>\"\",QCData!T54<>\"\",T54<>QCData!T54),\"C\",IF(AND(QCData!T54<>\"\",T54=\"\"),\"D\",\"no cd er\"))))","v":"S"},{"$f":"IF(U54=QCData!U54,\"S\",IF(AND(U54<>\"\",QCData!U54=\"\"),\"N\",IF(AND(U54<>\"\",QCData!U54<>\"\",U54<>QCData!U54),\"C\",IF(AND(QCData!U54<>\"\",U54=\"\"),\"D\",\"no cd er\"))))","v":"S"},{"$f":"IF(V54=QCData!V54,\"S\",IF(AND(V54<>\"\",QCData!V54=\"\"),\"N\",IF(AND(V54<>\"\",QCData!V54<>\"\",V54<>QCData!V54),\"C\",IF(AND(QCData!V54<>\"\",V54=\"\"),\"D\",\"no cd er\"))))","v":"S"},{"$f":"IF(W54=QCData!W54,\"S\",IF(AND(W54<>\"\",QCData!W54=\"\"),\"N\",IF(AND(W54<>\"\",QCData!W54<>\"\",W54<>QCData!W54),\"C\",IF(AND(QCData!W54<>\"\",W54=\"\"),\"D\",\"no cd er\"))))","v":"S"},{"$f":"IF(X54=QCData!X54,\"S\",IF(AND(X54<>\"\",QCData!X54=\"\"),\"N\",IF(AND(X54<>\"\",QCData!X54<>\"\",X54<>QCData!X54),\"C\",IF(AND(QCData!X54<>\"\",X54=\"\"),\"D\",\"no cd er\"))))","v":"S"},{"$f":"IF(Y54=QCData!Y54,\"S\",IF(AND(Y54<>\"\",QCData!Y54=\"\"),\"N\",IF(AND(Y54<>\"\",QCData!Y54<>\"\",Y54<>QCData!Y54),\"C\",IF(AND(QCData!Y54<>\"\",Y54=\"\"),\"D\",\"no cd er\"))))","v":"S"},{"$f":"IF(Z54=QCData!Z54,\"S\",IF(AND(Z54<>\"\",QCData!Z54=\"\"),\"N\",IF(AND(Z54<>\"\",QCData!Z54<>\"\",Z54<>QCData!Z54),\"C\",IF(AND(QCData!Z54<>\"\",Z54=\"\"),\"D\",\"no cd er\"))))","v":"S"}]
["","","","","","","","","","","","","","","","","","","","","","","","","","",null,null,null,null,null,null,null,null,null,null,null,null,null,null,null,null,null,null,null,null,null,null,null,null,null,null,null,null,null,null,null,null,null,null,null,null,null,null,null,null,null,null,null,null,null,null,null,null,null,null,null,null,null,null,null,null,null,null,null,null,null,null,null,null,null,null,null,null,null,null,null,null,null,null,null,null,null,null,null,null,null,null,null,null,null,null,null,null,null,null,null,null,null,null,null,null,null,null,null,null,null,null,null,null,null,null,null,null,null,null,null,null,null,null,null,null,null,null,null,null,null,null,null,null,null,null,null,null,null,null,{"$f":"IF(A55=QCData!A55,\"S\",IF(AND(A55<>\"\",QCData!A55=\"\"),\"N\",IF(AND(A55<>\"\",QCData!A55<>\"\",A55<>QCData!A55),\"C\",IF(AND(QCData!A55<>\"\",A55=\"\"),\"D\",\"no cd er\"))))","v":"S"},{"$f":"IF(B55=QCData!B55,\"S\",IF(AND(B55<>\"\",QCData!B55=\"\"),\"N\",IF(AND(B55<>\"\",QCData!B55<>\"\",B55<>QCData!B55),\"C\",IF(AND(QCData!B55<>\"\",B55=\"\"),\"D\",\"no cd er\"))))","v":"S"},{"$f":"IF(C55=QCData!C55,\"S\",IF(AND(C55<>\"\",QCData!C55=\"\"),\"N\",IF(AND(C55<>\"\",QCData!C55<>\"\",C55<>QCData!C55),\"C\",IF(AND(QCData!C55<>\"\",C55=\"\"),\"D\",\"no cd er\"))))","v":"S"},{"$f":"IF(D55=QCData!D55,\"S\",IF(AND(D55<>\"\",QCData!D55=\"\"),\"N\",IF(AND(D55<>\"\",QCData!D55<>\"\",D55<>QCData!D55),\"C\",IF(AND(QCData!D55<>\"\",D55=\"\"),\"D\",\"no cd er\"))))","v":"S"},{"$f":"IF(E55=QCData!E55,\"S\",IF(AND(E55<>\"\",QCData!E55=\"\"),\"N\",IF(AND(E55<>\"\",QCData!E55<>\"\",E55<>QCData!E55),\"C\",IF(AND(QCData!E55<>\"\",E55=\"\"),\"D\",\"no cd er\"))))","v":"S"},{"$f":"IF(F55=QCData!F55,\"S\",IF(AND(F55<>\"\",QCData!F55=\"\"),\"N\",IF(AND(F55<>\"\",QCData!F55<>\"\",F55<>QCData!F55),\"C\",IF(AND(QCData!F55<>\"\",F55=\"\"),\"D\",\"no cd er\"))))","v":"S"},{"$f":"IF(G55=QCData!G55,\"S\",IF(AND(G55<>\"\",QCData!G55=\"\"),\"N\",IF(AND(G55<>\"\",QCData!G55<>\"\",G55<>QCData!G55),\"C\",IF(AND(QCData!G55<>\"\",G55=\"\"),\"D\",\"no cd er\"))))","v":"S"},{"$f":"IF(H55=QCData!H55,\"S\",IF(AND(H55<>\"\",QCData!H55=\"\"),\"N\",IF(AND(H55<>\"\",QCData!H55<>\"\",H55<>QCData!H55),\"C\",IF(AND(QCData!H55<>\"\",H55=\"\"),\"D\",\"no cd er\"))))","v":"S"},{"$f":"IF(I55=QCData!I55,\"S\",IF(AND(I55<>\"\",QCData!I55=\"\"),\"N\",IF(AND(I55<>\"\",QCData!I55<>\"\",I55<>QCData!I55),\"C\",IF(AND(QCData!I55<>\"\",I55=\"\"),\"D\",\"no cd er\"))))","v":"S"},{"$f":"IF(J55=QCData!J55,\"S\",IF(AND(J55<>\"\",QCData!J55=\"\"),\"N\",IF(AND(J55<>\"\",QCData!J55<>\"\",J55<>QCData!J55),\"C\",IF(AND(QCData!J55<>\"\",J55=\"\"),\"D\",\"no cd er\"))))","v":"S"},{"$f":"IF(K55=QCData!K55,\"S\",IF(AND(K55<>\"\",QCData!K55=\"\"),\"N\",IF(AND(K55<>\"\",QCData!K55<>\"\",K55<>QCData!K55),\"C\",IF(AND(QCData!K55<>\"\",K55=\"\"),\"D\",\"no cd er\"))))","v":"S"},{"$f":"IF(L55=QCData!L55,\"S\",IF(AND(L55<>\"\",QCData!L55=\"\"),\"N\",IF(AND(L55<>\"\",QCData!L55<>\"\",L55<>QCData!L55),\"C\",IF(AND(QCData!L55<>\"\",L55=\"\"),\"D\",\"no cd er\"))))","v":"S"},{"$f":"IF(M55=QCData!M55,\"S\",IF(AND(M55<>\"\",QCData!M55=\"\"),\"N\",IF(AND(M55<>\"\",QCData!M55<>\"\",M55<>QCData!M55),\"C\",IF(AND(QCData!M55<>\"\",M55=\"\"),\"D\",\"no cd er\"))))","v":"S"},{"$f":"IF(N55=QCData!N55,\"S\",IF(AND(N55<>\"\",QCData!N55=\"\"),\"N\",IF(AND(N55<>\"\",QCData!N55<>\"\",N55<>QCData!N55),\"C\",IF(AND(QCData!N55<>\"\",N55=\"\"),\"D\",\"no cd er\"))))","v":"S"},{"$f":"IF(O55=QCData!O55,\"S\",IF(AND(O55<>\"\",QCData!O55=\"\"),\"N\",IF(AND(O55<>\"\",QCData!O55<>\"\",O55<>QCData!O55),\"C\",IF(AND(QCData!O55<>\"\",O55=\"\"),\"D\",\"no cd er\"))))","v":"S"},{"$f":"IF(P55=QCData!P55,\"S\",IF(AND(P55<>\"\",QCData!P55=\"\"),\"N\",IF(AND(P55<>\"\",QCData!P55<>\"\",P55<>QCData!P55),\"C\",IF(AND(QCData!P55<>\"\",P55=\"\"),\"D\",\"no cd er\"))))","v":"S"},{"$f":"IF(Q55=QCData!Q55,\"S\",IF(AND(Q55<>\"\",QCData!Q55=\"\"),\"N\",IF(AND(Q55<>\"\",QCData!Q55<>\"\",Q55<>QCData!Q55),\"C\",IF(AND(QCData!Q55<>\"\",Q55=\"\"),\"D\",\"no cd er\"))))","v":"S"},{"$f":"IF(R55=QCData!R55,\"S\",IF(AND(R55<>\"\",QCData!R55=\"\"),\"N\",IF(AND(R55<>\"\",QCData!R55<>\"\",R55<>QCData!R55),\"C\",IF(AND(QCData!R55<>\"\",R55=\"\"),\"D\",\"no cd er\"))))","v":"S"},{"$f":"IF(S55=QCData!S55,\"S\",IF(AND(S55<>\"\",QCData!S55=\"\"),\"N\",IF(AND(S55<>\"\",QCData!S55<>\"\",S55<>QCData!S55),\"C\",IF(AND(QCData!S55<>\"\",S55=\"\"),\"D\",\"no cd er\"))))","v":"S"},{"$f":"IF(T55=QCData!T55,\"S\",IF(AND(T55<>\"\",QCData!T55=\"\"),\"N\",IF(AND(T55<>\"\",QCData!T55<>\"\",T55<>QCData!T55),\"C\",IF(AND(QCData!T55<>\"\",T55=\"\"),\"D\",\"no cd er\"))))","v":"S"},{"$f":"IF(U55=QCData!U55,\"S\",IF(AND(U55<>\"\",QCData!U55=\"\"),\"N\",IF(AND(U55<>\"\",QCData!U55<>\"\",U55<>QCData!U55),\"C\",IF(AND(QCData!U55<>\"\",U55=\"\"),\"D\",\"no cd er\"))))","v":"S"},{"$f":"IF(V55=QCData!V55,\"S\",IF(AND(V55<>\"\",QCData!V55=\"\"),\"N\",IF(AND(V55<>\"\",QCData!V55<>\"\",V55<>QCData!V55),\"C\",IF(AND(QCData!V55<>\"\",V55=\"\"),\"D\",\"no cd er\"))))","v":"S"},{"$f":"IF(W55=QCData!W55,\"S\",IF(AND(W55<>\"\",QCData!W55=\"\"),\"N\",IF(AND(W55<>\"\",QCData!W55<>\"\",W55<>QCData!W55),\"C\",IF(AND(QCData!W55<>\"\",W55=\"\"),\"D\",\"no cd er\"))))","v":"S"},{"$f":"IF(X55=QCData!X55,\"S\",IF(AND(X55<>\"\",QCData!X55=\"\"),\"N\",IF(AND(X55<>\"\",QCData!X55<>\"\",X55<>QCData!X55),\"C\",IF(AND(QCData!X55<>\"\",X55=\"\"),\"D\",\"no cd er\"))))","v":"S"},{"$f":"IF(Y55=QCData!Y55,\"S\",IF(AND(Y55<>\"\",QCData!Y55=\"\"),\"N\",IF(AND(Y55<>\"\",QCData!Y55<>\"\",Y55<>QCData!Y55),\"C\",IF(AND(QCData!Y55<>\"\",Y55=\"\"),\"D\",\"no cd er\"))))","v":"S"},{"$f":"IF(Z55=QCData!Z55,\"S\",IF(AND(Z55<>\"\",QCData!Z55=\"\"),\"N\",IF(AND(Z55<>\"\",QCData!Z55<>\"\",Z55<>QCData!Z55),\"C\",IF(AND(QCData!Z55<>\"\",Z55=\"\"),\"D\",\"no cd er\"))))","v":"S"}]
["","","","","","","","","","","","","","","","","","","","","","","","","","",null,null,null,null,null,null,null,null,null,null,null,null,null,null,null,null,null,null,null,null,null,null,null,null,null,null,null,null,null,null,null,null,null,null,null,null,null,null,null,null,null,null,null,null,null,null,null,null,null,null,null,null,null,null,null,null,null,null,null,null,null,null,null,null,null,null,null,null,null,null,null,null,null,null,null,null,null,null,null,null,null,null,null,null,null,null,null,null,null,null,null,null,null,null,null,null,null,null,null,null,null,null,null,null,null,null,null,null,null,null,null,null,null,null,null,null,null,null,null,null,null,null,null,null,null,null,null,null,null,null,{"$f":"IF(A56=QCData!A56,\"S\",IF(AND(A56<>\"\",QCData!A56=\"\"),\"N\",IF(AND(A56<>\"\",QCData!A56<>\"\",A56<>QCData!A56),\"C\",IF(AND(QCData!A56<>\"\",A56=\"\"),\"D\",\"no cd er\"))))","v":"S"},{"$f":"IF(B56=QCData!B56,\"S\",IF(AND(B56<>\"\",QCData!B56=\"\"),\"N\",IF(AND(B56<>\"\",QCData!B56<>\"\",B56<>QCData!B56),\"C\",IF(AND(QCData!B56<>\"\",B56=\"\"),\"D\",\"no cd er\"))))","v":"S"},{"$f":"IF(C56=QCData!C56,\"S\",IF(AND(C56<>\"\",QCData!C56=\"\"),\"N\",IF(AND(C56<>\"\",QCData!C56<>\"\",C56<>QCData!C56),\"C\",IF(AND(QCData!C56<>\"\",C56=\"\"),\"D\",\"no cd er\"))))","v":"S"},{"$f":"IF(D56=QCData!D56,\"S\",IF(AND(D56<>\"\",QCData!D56=\"\"),\"N\",IF(AND(D56<>\"\",QCData!D56<>\"\",D56<>QCData!D56),\"C\",IF(AND(QCData!D56<>\"\",D56=\"\"),\"D\",\"no cd er\"))))","v":"S"},{"$f":"IF(E56=QCData!E56,\"S\",IF(AND(E56<>\"\",QCData!E56=\"\"),\"N\",IF(AND(E56<>\"\",QCData!E56<>\"\",E56<>QCData!E56),\"C\",IF(AND(QCData!E56<>\"\",E56=\"\"),\"D\",\"no cd er\"))))","v":"S"},{"$f":"IF(F56=QCData!F56,\"S\",IF(AND(F56<>\"\",QCData!F56=\"\"),\"N\",IF(AND(F56<>\"\",QCData!F56<>\"\",F56<>QCData!F56),\"C\",IF(AND(QCData!F56<>\"\",F56=\"\"),\"D\",\"no cd er\"))))","v":"S"},{"$f":"IF(G56=QCData!G56,\"S\",IF(AND(G56<>\"\",QCData!G56=\"\"),\"N\",IF(AND(G56<>\"\",QCData!G56<>\"\",G56<>QCData!G56),\"C\",IF(AND(QCData!G56<>\"\",G56=\"\"),\"D\",\"no cd er\"))))","v":"S"},{"$f":"IF(H56=QCData!H56,\"S\",IF(AND(H56<>\"\",QCData!H56=\"\"),\"N\",IF(AND(H56<>\"\",QCData!H56<>\"\",H56<>QCData!H56),\"C\",IF(AND(QCData!H56<>\"\",H56=\"\"),\"D\",\"no cd er\"))))","v":"S"},{"$f":"IF(I56=QCData!I56,\"S\",IF(AND(I56<>\"\",QCData!I56=\"\"),\"N\",IF(AND(I56<>\"\",QCData!I56<>\"\",I56<>QCData!I56),\"C\",IF(AND(QCData!I56<>\"\",I56=\"\"),\"D\",\"no cd er\"))))","v":"S"},{"$f":"IF(J56=QCData!J56,\"S\",IF(AND(J56<>\"\",QCData!J56=\"\"),\"N\",IF(AND(J56<>\"\",QCData!J56<>\"\",J56<>QCData!J56),\"C\",IF(AND(QCData!J56<>\"\",J56=\"\"),\"D\",\"no cd er\"))))","v":"S"},{"$f":"IF(K56=QCData!K56,\"S\",IF(AND(K56<>\"\",QCData!K56=\"\"),\"N\",IF(AND(K56<>\"\",QCData!K56<>\"\",K56<>QCData!K56),\"C\",IF(AND(QCData!K56<>\"\",K56=\"\"),\"D\",\"no cd er\"))))","v":"S"},{"$f":"IF(L56=QCData!L56,\"S\",IF(AND(L56<>\"\",QCData!L56=\"\"),\"N\",IF(AND(L56<>\"\",QCData!L56<>\"\",L56<>QCData!L56),\"C\",IF(AND(QCData!L56<>\"\",L56=\"\"),\"D\",\"no cd er\"))))","v":"S"},{"$f":"IF(M56=QCData!M56,\"S\",IF(AND(M56<>\"\",QCData!M56=\"\"),\"N\",IF(AND(M56<>\"\",QCData!M56<>\"\",M56<>QCData!M56),\"C\",IF(AND(QCData!M56<>\"\",M56=\"\"),\"D\",\"no cd er\"))))","v":"S"},{"$f":"IF(N56=QCData!N56,\"S\",IF(AND(N56<>\"\",QCData!N56=\"\"),\"N\",IF(AND(N56<>\"\",QCData!N56<>\"\",N56<>QCData!N56),\"C\",IF(AND(QCData!N56<>\"\",N56=\"\"),\"D\",\"no cd er\"))))","v":"S"},{"$f":"IF(O56=QCData!O56,\"S\",IF(AND(O56<>\"\",QCData!O56=\"\"),\"N\",IF(AND(O56<>\"\",QCData!O56<>\"\",O56<>QCData!O56),\"C\",IF(AND(QCData!O56<>\"\",O56=\"\"),\"D\",\"no cd er\"))))","v":"S"},{"$f":"IF(P56=QCData!P56,\"S\",IF(AND(P56<>\"\",QCData!P56=\"\"),\"N\",IF(AND(P56<>\"\",QCData!P56<>\"\",P56<>QCData!P56),\"C\",IF(AND(QCData!P56<>\"\",P56=\"\"),\"D\",\"no cd er\"))))","v":"S"},{"$f":"IF(Q56=QCData!Q56,\"S\",IF(AND(Q56<>\"\",QCData!Q56=\"\"),\"N\",IF(AND(Q56<>\"\",QCData!Q56<>\"\",Q56<>QCData!Q56),\"C\",IF(AND(QCData!Q56<>\"\",Q56=\"\"),\"D\",\"no cd er\"))))","v":"S"},{"$f":"IF(R56=QCData!R56,\"S\",IF(AND(R56<>\"\",QCData!R56=\"\"),\"N\",IF(AND(R56<>\"\",QCData!R56<>\"\",R56<>QCData!R56),\"C\",IF(AND(QCData!R56<>\"\",R56=\"\"),\"D\",\"no cd er\"))))","v":"S"},{"$f":"IF(S56=QCData!S56,\"S\",IF(AND(S56<>\"\",QCData!S56=\"\"),\"N\",IF(AND(S56<>\"\",QCData!S56<>\"\",S56<>QCData!S56),\"C\",IF(AND(QCData!S56<>\"\",S56=\"\"),\"D\",\"no cd er\"))))","v":"S"},{"$f":"IF(T56=QCData!T56,\"S\",IF(AND(T56<>\"\",QCData!T56=\"\"),\"N\",IF(AND(T56<>\"\",QCData!T56<>\"\",T56<>QCData!T56),\"C\",IF(AND(QCData!T56<>\"\",T56=\"\"),\"D\",\"no cd er\"))))","v":"S"},{"$f":"IF(U56=QCData!U56,\"S\",IF(AND(U56<>\"\",QCData!U56=\"\"),\"N\",IF(AND(U56<>\"\",QCData!U56<>\"\",U56<>QCData!U56),\"C\",IF(AND(QCData!U56<>\"\",U56=\"\"),\"D\",\"no cd er\"))))","v":"S"},{"$f":"IF(V56=QCData!V56,\"S\",IF(AND(V56<>\"\",QCData!V56=\"\"),\"N\",IF(AND(V56<>\"\",QCData!V56<>\"\",V56<>QCData!V56),\"C\",IF(AND(QCData!V56<>\"\",V56=\"\"),\"D\",\"no cd er\"))))","v":"S"},{"$f":"IF(W56=QCData!W56,\"S\",IF(AND(W56<>\"\",QCData!W56=\"\"),\"N\",IF(AND(W56<>\"\",QCData!W56<>\"\",W56<>QCData!W56),\"C\",IF(AND(QCData!W56<>\"\",W56=\"\"),\"D\",\"no cd er\"))))","v":"S"},{"$f":"IF(X56=QCData!X56,\"S\",IF(AND(X56<>\"\",QCData!X56=\"\"),\"N\",IF(AND(X56<>\"\",QCData!X56<>\"\",X56<>QCData!X56),\"C\",IF(AND(QCData!X56<>\"\",X56=\"\"),\"D\",\"no cd er\"))))","v":"S"},{"$f":"IF(Y56=QCData!Y56,\"S\",IF(AND(Y56<>\"\",QCData!Y56=\"\"),\"N\",IF(AND(Y56<>\"\",QCData!Y56<>\"\",Y56<>QCData!Y56),\"C\",IF(AND(QCData!Y56<>\"\",Y56=\"\"),\"D\",\"no cd er\"))))","v":"S"},{"$f":"IF(Z56=QCData!Z56,\"S\",IF(AND(Z56<>\"\",QCData!Z56=\"\"),\"N\",IF(AND(Z56<>\"\",QCData!Z56<>\"\",Z56<>QCData!Z56),\"C\",IF(AND(QCData!Z56<>\"\",Z56=\"\"),\"D\",\"no cd er\"))))","v":"S"}]

{"sheet":"Reconditiondata","index":6,"n_rows":29,"n_cols":29,"rows_kept":29,"cut":false,"hidden":true,"merged":[]}
[]
[]
[]
[]
[]
[]
[]
[]
[]
[]
[]
[]
[]
[]
[]
[]
[]
[]
[]
[]
[]
[]
["The cells below in A30 to Z56 contain conditional formatting that is recopied to the QCData worksheet cells A30 to z56 after Accepting and pasting in the data from the import worksheet."]
[]
[]
[null,null,null,null,null,null,null,null,null,null,null,null,null,"BE",null,null,null,null,"BF","BG",null,null,null,null,null,null,"BH","BI","BJ"]
["TEST NO.","Date","Tons in sublot","Lot No.","Sublot No","3 Out",null,null,null,null,null,null,null,null,null,null,null,null,null,null,null,null,null,null,null,null,"MTD ","AV","Comp"]
[null,"(Beg of ","using Method",null,null,"in 1 Day?",null,null,null,null,null,null,null,null,null,null,null,null,null,null,"%MTD","%MTD","%MTD","Briquette 1","Briquette 2","Briquette 3"]
[null,"sublot)","Compaction",null,null,"Yes or NO","2\"","1-1/2\"","1\"","3/4\"","1/2\"","3/8\"","#4","#8","#16","#30","#50","#100","#200","B.C.","Core 1","Core 2","Core 3","Air Voids","Air Voids","Air Voids"]

{"sheet":"Beta PWL Calculation","index":7,"n_rows":52,"n_cols":16,"rows_kept":52,"cut":false,"hidden":true,"merged":[[0,0,0,9],[21,0,21,15]]}
["1-Sided Beta PWL calculation"]
["Sublot","Test Result","Lot Averge","Lot Standard Deviation","Quality Index (Q)","Number Tests in Lot","d2","x","PWL","LSL"]
["1A1",3850]
["1A2"]
["1B1"]
["1B2"]
["1C1"]
["1C2"]
["1D1"]
["1D2"]
["1E1"]
["1E2",null,{"$f":"AVERAGE(B3:B12)","v":3850},{"$f":"IF(STDEV(B3:B12)<0.001,0.001,STDEV(B3:B12))","v":{"$error":"#DIV/0!"}},{"$f":"(C12-J12)/D12","v":{"$error":"#DIV/0!"}},{"$f":"COUNT(B3:B12)","v":1},{"$f":"SQRT(F12)","v":1},{"$f":"IF(MAX(0,0.5-(E12*G12/(2*(F12-1))))>1,1,MAX(0,0.5-(E12*G12/(2*(F12-1)))))","v":{"$error":"#DIV/0!"}},{"$f":"100-(BETADIST(H12,(F12/2)-1,(F12/2)-1))*100","v":{"$error":"#DIV/0!"}},3000]
[]
[]
[]
[]
[]
[]
[]
[]
[]
["2-sided Beta PWL Calculation"]
["Sublot",null,"Lot Averge","Lot Standard Deviation","QUV","Number Tests in Lot","d2","x","PWLUV","USL","QLLV","d2","x","PWLLV","LSL","PWL"]
["1",5.0999999999999996]
["2"]
["3"]
["4"]
["5"]
["6"]
["7"]
["8"]
["9"]
["10"]
["11"]
["12"]
["13"]
["14"]
["15"]
["16"]
["17"]
["18"]
["19"]
["20"]
["21"]
["22",5.4]
["23",5.3]
["24"]
["25"]
["26"]
["27"]
["28"]
[null,null,{"$f":"AVERAGE(B24:B52)","v":5.2666666666666666},{"$f":"IF(STDEV(B24:B52)<0.001,0.001,STDEV(B24:B52))","v":0.152752523165195},{"$f":"(J52-C52)/D52","v":17.893866999351339},{"$f":"COUNT(B24:B52)","v":3},{"$f":"SQRT(F52)","v":1.7320508075688772},"=IF(MAX(0,0.5-(E52*G52/(2*(F52-1))))>1,1,MAX(0,0.5-(E52*G52/(2*(F52-1)))))",{"$f":"100-(BETADIST(H52,(F52/2)-1,(F52/2)-1))*100","v":{"$error":"#VALUE!"}},8,{"$f":"(C52-O52)/D52","v":1.7457431218879349},{"$f":"SQRT(F52)","v":1.7320508075688772},{"$f":"IF(MAX(0,0.5-(K52*L52/(2*(F52-1))))>1,1,MAX(0,0.5-(K52*L52/(2*(F52-1)))))","v":0},{"$f":"100-(BETADIST(M52,(F52/2)-1,(F52/2)-1))*100","v":100},5,{"$f":"N52+I52-100","v":{"$error":"#VALUE!"}}]