{"text_format":"1","workbook":"xlsx","n_sheets":8,"sheets":["LotInfo","QCData","Verification","F Table","TCrit","Imported QCData","Reconditiondata","Beta PWL Calculation"],"not_rendered":{"charts":10,"images":1,"macros":1,"external_links":0,"defined_names":141,"comments":2,"pivot_tables":0},"unopened":[],"bounds":{"document_bytes":16777216,"sheet_cells":100000,"rows_first":2000,"rows_last":500,"rows_between":2000,"halvings":0,"cell_chars":16384,"cell_head_chars":4096},"cells_cut":0,"cells_raw":0,"read":"whole","date_system":"1900"}

{"sheet":"LotInfo","index":0,"n_rows":368,"n_cols":54,"rows_kept":368,"cut":false,"hidden":false,"merged":[]}
["LotInfo Worksheet",null,null,null,null,null,null,"Contractor QC Mgr Job #",null,null,null,null,"Enter Lot Number:"]
[]
["BETA PWL Spreadsheet (SPFPay):    For use with Caltrans Statistical Pay Factor (SPF) Specifications ",null,null,null,null,null,null,null,null,null,null,null,null,null,null,null,null,"© 2020 California Department of Transportation"]
["(Always visit the website below and use the most recent version of this spreadsheet.)",null,null,null,null,null,null,null,null,null,null,null,null,null,"Vers 1.02  issued 6/30/2020"]
["https://dot.ca.gov/programs/construction/hot-mix-asphalt-construction",null,null,null,null,null,null,"Project Name:"]
[null,"for version update history see cell B100",null,null,null,null,null,"EA (or Project ID):",null,null,null,"Contractor:"]
[null,"Need help w/ setting \"Trusted Folders\"? See cell BA100",null,null,null,null,null,"JMF No.",null,null,null,"HMA Plant:"]
[null,null,null,null,null,null,null,"Co/Rte/PM:",null,null,null,"QC Manager:"]
[null,null,null,null,null,null,null,null,null,null,null,"Resident Engineer:"]
[null,null,null,null,null,null,null,"HMA Type:",null,"3/4\" HMA Type A",null,"QC Lab:"]
[null,null,null,null,null,null,null,null,null,null,null,null,"Item Price:"]
[null,null,null,null,null,null,null,"Projects Specified PG Grade:",null,null,null,null,"Bid Item #"]
[null,null,null,null,null,null,null,"PG Grade used in JMF:",null,null,null,null,null,null,null,null,null,null,"(Enter data into the underlined unprotected cells to the left)",null,null,null,null,null,null,null,null,null,null,null,null,null,null,null,null,null,null,null,null,null,null,null,null,null,null,null,null,null,null,null,null,null," "]
[null,null,null,null,null,null,null,{"$f":"IF(OR(hmatype=mixa1,hmatype=mixa2,hmatype=mixb1,hmatype=mixb2,hmatype=mixc1),\"%RAP Agg in Agg Blend:\",\"\")","v":"%RAP Agg in Agg Blend:"},null,{"$f":"IF(OR(hmatype=mixa1,hmatype=mixa2,hmatype=mixb1,hmatype=mixb2,hmatype=mixc1),\"%  (Type A HMA Only)\",\"\")","v":"%  (Type A HMA Only)"}]
[null,null,null,null,"`"]
[null,null,null,null,null,null,null,"Binder Source:"]
[null,null,null,null,null,null,null,"Add'l Binder Desc:"]
[]
[]
[]
{"$rows_left_out":349}
{"sheet":"QCData","index":1,"n_rows":300,"n_cols":97,"rows_kept":300,"cut":false,"hidden":false,"merged":[]}
["QCData Worksheet"]
[null,null,null,null,null,null,null,null,null,null,null,null,null,null,"EA(or Project ID):",{"$f":"IF(ea=\"\",\"\",dist_ea)","v":""},null,null,null,null,null,null,"© 2020 California Department of Transportation"]
[null,null,null,null,null,null,null,null,null,null,null,null,null,null,"Resident Engineer:",{"$f":"IF(resengrname=\"\",\"\",resengrname)","v":""},null,null,null,null,null,null,null,null,null,null,null,null,null,"Count test values violating Rule 1 or Rule 2"]
[null,null,null,null,null,null,null,null,null,null,null,null,null,null,"Quality Control Manager:",{"$f":"IF(qcmanagername=\"\",\"\",qcmanagername)","v":""},null,null,null,null,"Contractor QC Mgr Job #:",{"$f":"IF(QCjobno=\"\",\"\",QCjobno)","v":""},null,null,null,null,null,null,null,"Code (for Rule 1): 0, 1, 2, 3, …….===> Number of times QC data out of tolerance"]
[null,null,null,null,null,null,null,null,null,null,null,null,null,null,"HMA Type:",{"$f":"IF(hmatype=\"\",\"\",hmatype)","v":"3/4\" HMA Type A"},null,null,null,null,"Contractor:",{"$f":"IF(contractorname=\"\",\"\",contractorname)","v":""},null,null,null,null,null,null,null,"Code (for Rule 2): 888 ===> QF less than 0.75; 999 ===> QF less than 0.9"]
[null,null,null,null,null,null,null,null,null,null,null,null,null,null,"JMF  No:",{"$f":"IF(jmf=\"\",\"\",jmf)","v":""},null,null,null,null,"HMA Plant:",{"$f":"IF(hmaplant=\"\",\"\",hmaplant)","v":""}]
[null,null,null,null,null,null,null,null,null,null,null,null,null,null,"Lot No:",{"$f":"IF(lotno=\"\",\"\",lotno)","v":""},null,null,null,null,"QC Lab:",{"$f":"IF(QClab=\"\",\"\",QClab)","v":""}]
[]
[null,null,null,null,null,null,null,null,null,null,"exported QCdata file name =>",{"$f":"dist_ea&\"_QCData\"   &\"_\"&jmf&\"_LotNo\"                                          &TEXT(lotno,\"00\")&\"_\"&(YEAR(TODAY())&\"-\"&TEXT(MONTH(TODAY()),\"dd\")&\"-\"&TEXT(DAY(TODAY()),\"dd\"))","v":"_QCData__LotNo00_2020-06-30"},null,null,null,null,null,null,null,null,null,null,null,null,null,null,null,null,null,"Documentation on logic used in this section:"]
[null,null,null,null,null,null,null,null,null,null,null,null,null,null,null,null,null,null,null,null,null,null,null,null,null,null,null,null,null,"If there is a weighting factor, and the test value is out of spec limits then cell equals 1, no reason to count number out in a row if a weighting factor exists."]
[null,null,null,null,null,null,null,null,null,null,null,null,null,null,null,null,null,null,null,null,null,null,null,null,null,null,null,null,null,"Otherwise cell could still have a weighting factor and test value is in spec, …. If so, then cell value is set to 0."]
[null,null,null,null,"Rule 1",null,"If no weighting factor, but has a specification limit, two failed tests in a row highlights red, requires stop production, terminate lot. Contrctor must also manually check for 3 consecutive in one day.",null,null,null,null,null,null,null,null,null,null,null,null,null,null,null,null,null,null,null,null,null,null,"Also, if charachteristic  not reportable (\"nr\"), or no spec limit exists,  but the values must be reported (\"nsl / mr\"), then also set the cell value equal to 0."]
[null,null,null,null,"Rule 2",null,"If weighting factor, a QFQC must be calculated. If cell goes red, QFQC is too low, stop production, terminate lot.",null,null,null,null,null,null,null,null,null,null,null,null,null,null,null,null,null,null,null,null,null,null,"If none of the above, then charachteristic has a spec limit, now count how many in a row are out of spec."]
[]
[null,null,null,null,"Rule 3",null,"No specification limits. Report test value only (per CT 202)",null,null,null,null,null,null,null,null,null,null,null,null,null,null,null,null,null,null,null,null,null,null,"Rule 1","If no weighting factor, but has spec limit, then two failed tests in a row requires ending lot."]
[null,null,null,null,"Rule 4",null,"3 Failing Tests in 1 Day",null,null,null,null,null,null,null,null,null,null,null,null,null,null,null,null,null,null,null,null,null,null,"Rule 2","If weighting factor, a QFQC must be calculated for the last 20 tests (including overlap from previous lots)",null,null,null,null,null,null,null,null,null,null,null,null,null,null,null,null,null,null,null,null,null,null,null,null,"n",{"$f":"COUNT(N30:N56)","v":0},{"$f":"COUNT(S30:S56)","v":0},{"$f":"COUNT(T30:T56)","v":0},{"$f":"COUNT(AA30:AA56)","v":0},{"$f":"COUNT(AB30:AB56)","v":0}]
[null,null,null,null,null,null,"2\"","1-1/2\"","1\"","3/4\"","1/2\"","3/8\"","#4","#8","#16","#30","#50","#100","#200","B.C.",null,null,null,null,null,null,"%MTD","% Air Voids",null,null,null,"The QFQC will also be calculated for on through 5, 5, …20 until twenty tests are recorded.",null,null,null,null,null,null,null,null,null,null,null,null,null,null,null,null,null,null,null,null,null,null,null,"Mean",{"$f":"AVERAGE(N30:N56)","v":{"$error":"#DIV/0!"}},{"$f":"AVERAGE(S30:S56)","v":{"$error":"#DIV/0!"}},{"$f":"AVERAGE(T30:T56)","v":{"$error":"#DIV/0!"}},{"$f":"AVERAGE(AA30:AA56)","v":{"$error":"#DIV/0!"}},{"$f":"AVERAGE(AB30:AB56)","v":{"$error":"#DIV/0!"}}]
[null,null,null,null,null,null,null,null,null,null,null,null,null,null,null,null,null,null,null,null,null,null,null,null,null,null,null,null,null,"Rule 3","No Specification Check Rules, Simply report value",null,null,null,null,null,null,null,null,null,null,null,null,null,null,null,null,null,null,null,null,null,null,null,null,"Std Dev",{"$f":"IF(_n8<3,\"\",STDEV(N30:N56))","v":""},{"$f":"IF(_n200<3,\"\",STDEV(S30:S56))","v":""},{"$f":"IF(_nBC<3,\"\",STDEV(T30:T56))","v":""},{"$f":"IF(_nMTD<3,\"\",STDEV(AA30:AA56))","v":""},{"$f":"IF(_nAV<3,\"\",STDEV(AB30:AB56))","v":""}]
[null,null,null,null,null,"JMF Target Value",null,{"$f":"IF(LotInfo!D27=\"\",\"\",LotInfo!D27)","v":""},{"$f":"IF(LotInfo!E27=\"\",\"\",LotInfo!E27)","v":""},{"$f":"IF(LotInfo!F27=\"\",\"\",LotInfo!F27)","v":""},{"$f":"IF(LotInfo!G27=\"\",\"\",LotInfo!G27)","v":""},{"$f":"IF(LotInfo!H27=\"\",\"\",LotInfo!H27)","v":""},{"$f":"IF(LotInfo!I27=\"\",\"\",LotInfo!I27)","v":""},{"$f":"IF(LotInfo!J27=\"\",\"\",LotInfo!J27)","v":""},{"$f":"IF(LotInfo!K27=\"\",\"\",LotInfo!K27)","v":""},{"$f":"IF(LotInfo!L27=\"\",\"\",LotInfo!L27)","v":""},{"$f":"IF(LotInfo!M27=\"\",\"\",LotInfo!M27)","v":""},{"$f":"IF(LotInfo!N27=\"\",\"\",LotInfo!N27)","v":""},{"$f":"IF(LotInfo!O27=\"\",\"\",LotInfo!O27)","v":""},{"$f":"IF(LotInfo!P27=\"\",\"\",LotInfo!P27)","v":""},null,null,null,null,null,null,{"$f":"IF(LotInfo!Q27=\"\",\"\",LotInfo!Q27)","v":""},{"$f":"IF(LotInfo!R27=\"\",\"\",LotInfo!R27)","v":4},null,"Rule 4","No reporting required.",null,null,null,null,null,null,null,null,null,null,null,null,null,null,null,null,null,null,null,null,null,null,null,null,null,"#8","#200","B.C.","%MTD","%AV"]
[null,null,null,null,null,"Production Tolerance",{"$f":"LotInfo!C29","v":""},{"$f":"LotInfo!D29","v":""},{"$f":"LotInfo!E29","v":0},{"$f":"LotInfo!F29","v":5},{"$f":"LotInfo!G29","v":6},{"$f":"LotInfo!H29","v":"nsl / mr"},{"$f":"LotInfo!I29","v":5},{"$f":"LotInfo!J29","v":5},{"$f":"LotInfo!K29","v":"nsl / mr"},{"$f":"LotInfo!L29","v":4},{"$f":"LotInfo!M29","v":"nsl / mr"},{"$f":"LotInfo!N29","v":"nsl / mr"},{"$f":"LotInfo!O29","v":2},{"$f":"LotInfo!P29","v":0.4},null,null,null,null,null,null,null,null,null,null,null,null,null,null,null,null,null,null,null,null,null,null,null,null,null,null,null,null,null,null,null,null,null,null,null,"index (i)=",1,2,3,5,4]
{"$rows_left_out":281}
{"sheet":"Verification","index":2,"n_rows":104,"n_cols":26,"rows_kept":104,"cut":false,"hidden":false,"merged":[]}
["Verification and Payment Worksheet",null,null,null,null,null,null,null,null,{"$f":"\"SPFPay Lot # \"&lotno&\", Contract \"&dist_ea","v":"SPFPay Lot # , Contract "}]
[" (Engineer Enters Verification Test Results on Rows 45 to 72)",null,null,null,null,null,null,"© 2020 California Department of Transportation",null,{"$f":"IF(contractorname=\"\",\"\",contractorname)","v":""}]
[null,null,null,null,null,"Pay Factor Quality Charachteristic (JMF Targets, Upper and Lower Spec Limits, and weighting factors)"]
[null,null,null,null,"Quality Characteristic","#8","#200","Binder Content","Field Compaction","Air Voids"]
[null,null,null,null,"Target Value",{"$f":"LotInfo!J27","v":0},{"$f":"LotInfo!O27","v":0},{"$f":"LotInfo!P27","v":0},{"$f":"LotInfo!Q27","v":0},{"$f":"LotInfo!R27","v":4}]
[null,null,null,null,"Production Tolerance",{"$f":"LotInfo!J29","v":5},{"$f":"LotInfo!O29","v":2},{"$f":"LotInfo!P29","v":0.4},{"$f":"LotInfo!Q29","v":0},{"$f":"LotInfo!R29","v":1.5}]
[null,null,null,null,"Upper Specification Limit",{"$f":"LotInfo!J30","v":""},{"$f":"LotInfo!O30","v":""},{"$f":"LotInfo!P30","v":""},{"$f":"LotInfo!Q30","v":96},{"$f":"LotInfo!R30","v":5.5}]
[null,null,null,null,"Lower Specification Limit",{"$f":"LotInfo!J31","v":""},{"$f":"LotInfo!O31","v":""},{"$f":"LotInfo!P31","v":""},{"$f":"LotInfo!Q31","v":92},{"$f":"LotInfo!R31","v":2.5}]
[null,null,null,null,"Weighting Factor   (w)",{"$f":"LotInfo!J32","v":0.05},{"$f":"LotInfo!O32","v":0.1},{"$f":"LotInfo!P32","v":0.25},{"$f":"LotInfo!Q32","v":0.4},{"$f":"LotInfo!R32","v":0.2}]
["Contractors QC Data from QCData Worksheet"]
[null,null,null,null,"Averages; QC & Verification",{"$f":"\"QC=\"&IFERROR(TEXT(ROUND(AVERAGE(F14:F40),1),\"0.0\"),\"\")&\", Verif=\"&IFERROR(TEXT(ROUND(AVERAGE(F45:F71),1),\"0.0\"),\"\")","v":"QC=, Verif="},{"$f":"\"QC=\"&IFERROR(TEXT(ROUND(AVERAGE(G14:G40),2),\"0.00\"),\"\")&\", Verif=\"&IFERROR(TEXT(ROUND(AVERAGE(G45:G71),2),\"0.00\"),\"\")","v":"QC=, Verif="},"QC=, Verif=","QC=, Verif=","QC=, Verif="]
[null,null,null,null,"Std Deviations;  QC & Verification",{"$f":"\"QC=\"&IFERROR(TEXT(ROUND(STDEV(F15:F41),1),\"0.0\"),\"\")&\", Verif=\"&IFERROR(TEXT(ROUND(STDEV(F46:F72),1),\"0.0\"),\"\")","v":"QC=, Verif="},{"$f":"\"QC=\"&IFERROR(TEXT(ROUND(STDEV(G15:G41),2),\"0.00\"),\"\")&\", Verif=\"&IFERROR(TEXT(ROUND(STDEV(G46:G72),2),\"0.00\"),\"\")","v":"QC=, Verif="},"QC=, Verif=","QC=, Verif=","QC=, Verif="]
["TEST NO.","Date","Tons of Material in sublot with waived density paid to use a QF=1.00","Lot No.","Sublot No.","#8","#200","Binder Content","Field Compaction","Air Voids"]
[{"$f":"IF((QCData!A30=\"\"),\"\",QCData!A30)","v":""},{"$f":"IF(QCData!B30=\"\",\"\",QCData!B30)","v":""},{"$f":"IF((QCData!C30=\"\"),\"\",QCData!C30)","v":""},{"$f":"IF((QCData!D30=\"\"),\"\",QCData!D30)","v":""},{"$f":"IF((QCData!E30=\"\"),\"\",QCData!E30)","v":""},{"$f":"IF((QCData!N30=\"\"),\"\",QCData!N30)","v":""},{"$f":"IF((QCData!S30=\"\"),\"\",QCData!S30)","v":""},{"$f":"IF((QCData!T30=\"\"),\"\",QCData!T30)","v":""},{"$f":"IF((QCData!AA30=\"\"),\"\",QCData!AA30)","v":""},{"$f":"IF((QCData!AB30=\"\"),\"\",QCData!AB30)","v":""}]
[{"$f":"IF((QCData!A31=\"\"),\"\",QCData!A31)","v":""},{"$f":"IF(QCData!B31=\"\",\"\",QCData!B31)","v":""},{"$f":"IF((QCData!C31=\"\"),\"\",QCData!C31)","v":""},{"$f":"IF((QCData!D31=\"\"),\"\",QCData!D31)","v":""},{"$f":"IF((QCData!E31=\"\"),\"\",QCData!E31)","v":""},{"$f":"IF((QCData!N31=\"\"),\"\",QCData!N31)","v":""},{"$f":"IF((QCData!S31=\"\"),\"\",QCData!S31)","v":""},{"$f":"IF((QCData!T31=\"\"),\"\",QCData!T31)","v":""},{"$f":"IF((QCData!AA31=\"\"),\"\",QCData!AA31)","v":""},{"$f":"IF((QCData!AB31=\"\"),\"\",QCData!AB31)","v":""}]
[{"$f":"IF((QCData!A32=\"\"),\"\",QCData!A32)","v":""},{"$f":"IF(QCData!B32=\"\",\"\",QCData!B32)","v":""},{"$f":"IF((QCData!C32=\"\"),\"\",QCData!C32)","v":""},{"$f":"IF((QCData!D32=\"\"),\"\",QCData!D32)","v":""},{"$f":"IF((QCData!E32=\"\"),\"\",QCData!E32)","v":""},{"$f":"IF((QCData!N32=\"\"),\"\",QCData!N32)","v":""},{"$f":"IF((QCData!S32=\"\"),\"\",QCData!S32)","v":""},{"$f":"IF((QCData!T32=\"\"),\"\",QCData!T32)","v":""},{"$f":"IF((QCData!AA32=\"\"),\"\",QCData!AA32)","v":""},{"$f":"IF((QCData!AB32=\"\"),\"\",QCData!AB32)","v":""}]
[{"$f":"IF((QCData!A33=\"\"),\"\",QCData!A33)","v":""},{"$f":"IF(QCData!B33=\"\",\"\",QCData!B33)","v":""},{"$f":"IF((QCData!C33=\"\"),\"\",QCData!C33)","v":""},{"$f":"IF((QCData!D33=\"\"),\"\",QCData!D33)","v":""},{"$f":"IF((QCData!E33=\"\"),\"\",QCData!E33)","v":""},{"$f":"IF((QCData!N33=\"\"),\"\",QCData!N33)","v":""},{"$f":"IF((QCData!S33=\"\"),\"\",QCData!S33)","v":""},{"$f":"IF((QCData!T33=\"\"),\"\",QCData!T33)","v":""},{"$f":"IF((QCData!AA33=\"\"),\"\",QCData!AA33)","v":""},{"$f":"IF((QCData!AB33=\"\"),\"\",QCData!AB33)","v":""}]
[{"$f":"IF((QCData!A34=\"\"),\"\",QCData!A34)","v":""},{"$f":"IF(QCData!B34=\"\",\"\",QCData!B34)","v":""},{"$f":"IF((QCData!C34=\"\"),\"\",QCData!C34)","v":""},{"$f":"IF((QCData!D34=\"\"),\"\",QCData!D34)","v":""},{"$f":"IF((QCData!E34=\"\"),\"\",QCData!E34)","v":""},{"$f":"IF((QCData!N34=\"\"),\"\",QCData!N34)","v":""},{"$f":"IF((QCData!S34=\"\"),\"\",QCData!S34)","v":""},{"$f":"IF((QCData!T34=\"\"),\"\",QCData!T34)","v":""},{"$f":"IF((QCData!AA34=\"\"),\"\",QCData!AA34)","v":""},{"$f":"IF((QCData!AB34=\"\"),\"\",QCData!AB34)","v":""}]
[{"$f":"IF((QCData!A35=\"\"),\"\",QCData!A35)","v":""},{"$f":"IF(QCData!B35=\"\",\"\",QCData!B35)","v":""},{"$f":"IF((QCData!C35=\"\"),\"\",QCData!C35)","v":""},{"$f":"IF((QCData!D35=\"\"),\"\",QCData!D35)","v":""},{"$f":"IF((QCData!E35=\"\"),\"\",QCData!E35)","v":""},{"$f":"IF((QCData!N35=\"\"),\"\",QCData!N35)","v":""},{"$f":"IF((QCData!S35=\"\"),\"\",QCData!S35)","v":""},{"$f":"IF((QCData!T35=\"\"),\"\",QCData!T35)","v":""},{"$f":"IF((QCData!AA35=\"\"),\"\",QCData!AA35)","v":""},{"$f":"IF((QCData!AB35=\"\"),\"\",QCData!AB35)","v":""}]
[{"$f":"IF((QCData!A36=\"\"),\"\",QCData!A36)","v":""},{"$f":"IF(QCData!B36=\"\",\"\",QCData!B36)","v":""},{"$f":"IF((QCData!C36=\"\"),\"\",QCData!C36)","v":""},{"$f":"IF((QCData!D36=\"\"),\"\",QCData!D36)","v":""},{"$f":"IF((QCData!E36=\"\"),\"\",QCData!E36)","v":""},{"$f":"IF((QCData!N36=\"\"),\"\",QCData!N36)","v":""},{"$f":"IF((QCData!S36=\"\"),\"\",QCData!S36)","v":""},{"$f":"IF((QCData!T36=\"\"),\"\",QCData!T36)","v":""},{"$f":"IF((QCData!AA36=\"\"),\"\",QCData!AA36)","v":""},{"$f":"IF((QCData!AB36=\"\"),\"\",QCData!AB36)","v":""}]
{"$rows_left_out":85}
{"sheet":"F Table","index":3,"n_rows":35,"n_cols":33,"rows_kept":35,"cut":false,"hidden":true,"merged":[[3,3,3,32],[5,1,26,1]]}
[null,"Note: to simplify using the vlookup function on the LotXPay worksheet the  table was flipped diagonally.  Typically this table has the denominator values along the left edge and the Numerator across the top."]
[]
[]
[null,null,null,"Degree of Freedom (nc-1) for Denominator"]
[null,null,null,1,2,3,4,5,6,7,8,9,10,11,12,13,14,15,16,17,18,19,20,21,22,23,24,25,26,27,28,29,30]
[null,"Degree of freedom ( (nv-1) for Numerator",1,647.79999999999995,38.51,17.440000000000001,12.22,10.01,8.81,8.07,7.57,7.21,6.94,6.72,6.55,6.41,6.3,6.2,6.12,6.04,5.98,5.92,5.87,5.83,5.79,5.75,5.72,5.69,5.66,5.63,5.61,5.59,5.57]
[null,null,2,799.5,39,16.04,10.65,8.43,7.26,6.54,6.06,5.71,5.46,5.26,5.0999999999999996,4.97,4.8600000000000003,4.7699999999999996,4.6900000000000004,4.62,4.5599999999999996,4.51,4.46,4.42,4.38,4.3499999999999996,4.32,4.29,4.2699999999999996,4.24,4.22,4.2,4.18]
[null,null,3,864.2,39.17,15.44,9.98,7.76,6.6,5.89,5.42,5.08,4.83,4.63,4.47,4.3499999999999996,4.24,4.1500000000000004,4.08,4.01,3.95,3.9,3.86,3.82,3.78,3.75,3.72,3.69,3.67,3.65,3.63,3.61,3.59]
[null,null,4,899.6,39.25,15.1,9.6,7.39,6.23,5.52,5.05,4.72,4.47,4.28,4.12,4,3.89,3.8,3.73,3.66,3.61,3.56,3.51,3.48,3.44,3.41,3.38,3.35,3.33,3.31,3.29,3.27,3.25]
[null,null,5,921.8,39.299999999999997,14.88,9.36,7.15,5.99,5.29,4.82,4.4800000000000004,4.24,4.04,3.89,3.77,3.66,3.58,3.5,3.44,3.38,3.33,3.29,3.25,3.22,3.18,3.15,3.13,3.1,3.08,3.06,3.04,3.03]
[null,null,6,937.1,39.33,14.73,9.1999999999999993,6.98,5.82,5.12,4.6500000000000004,4.32,4.07,3.88,3.73,3.6,3.5,3.41,3.34,3.28,3.22,3.17,3.13,3.09,3.05,3.02,2.99,2.97,2.94,2.92,2.9,2.88,2.87]
[null,null,7,948.2,39.36,14.62,9.07,6.85,5.7,4.99,4.53,4.2,3.95,3.76,3.61,3.48,3.38,3.29,3.22,3.16,3.1,3.05,3.01,2.97,2.93,2.9,2.87,2.85,2.82,2.8,2.78,2.76,2.75]
[null,null,8,956.7,39.369999999999997,14.54,8.98,6.76,5.6,4.9000000000000004,4.43,4.0999999999999996,3.85,3.66,3.51,3.39,3.29,3.2,3.12,3.06,3.01,2.96,2.91,2.87,2.84,2.81,2.78,2.75,2.73,2.71,2.69,2.67,2.65]
[null,null,9,963.3,39.39,14.47,8.9,6.68,5.52,4.82,4.3600000000000003,4.03,3.78,3.59,3.44,3.31,3.21,3.12,3.05,2.98,2.93,2.88,2.84,2.8,2.76,2.73,2.7,2.68,2.65,2.63,2.61,2.59,2.57]
[null,null,10,968.6,39.4,14.42,8.84,6.62,5.46,4.76,4.3,3.96,3.72,3.53,3.37,3.25,3.15,3.06,2.99,2.92,2.87,2.82,2.77,2.73,2.7,2.67,2.64,2.61,2.59,2.57,2.5499999999999998,2.5299999999999998,2.5099999999999998]
[null,null,11,{"$f":"ROUND(AVERAGE(D15,D17),3)","v":972.65},{"$f":"ROUND(AVERAGE(E15,E17),3)","v":39.405000000000001},14.38,8.7949999999999999,6.57,5.415,4.7149999999999999,4.25,3.915,3.67,3.48,3.3250000000000002,3.2,3.1,3.01,2.94,2.87,2.82,2.77,2.7250000000000001,2.6850000000000001,2.65,2.62,2.59,2.56,2.54,2.52,2.5,2.48,2.46]
[null,null,12,976.7,39.409999999999997,14.34,8.75,6.52,5.37,4.67,4.2,3.87,3.62,3.43,3.28,3.15,3.05,2.96,2.89,2.82,2.77,2.72,2.68,2.64,2.6,2.57,2.54,2.5099999999999998,2.4900000000000002,2.4700000000000002,2.4500000000000002,2.4300000000000002,2.41]
[null,null,13,{"$f":"ROUND(D17+((D20-D17)*(1/3)),3)","v":979.43299999999999},{"$f":"ROUND(E17+((E20-E17)*(1/3)),3)","v":39.417000000000002},14.31,8.7200000000000006,6.49,5.3369999999999997,4.6369999999999996,4.1669999999999998,3.8370000000000002,3.5870000000000002,3.3969999999999998,3.2469999999999999,3.117,3.0169999999999999,2.927,2.8570000000000002,2.7869999999999999,2.7370000000000001,2.6869999999999998,2.6429999999999998,2.6030000000000002,2.5670000000000002,2.5369999999999999,2.5070000000000001,2.4769999999999999,2.4569999999999999,2.4329999999999998,2.4129999999999998,2.3929999999999998,2.3769999999999998]
[null,null,14,{"$f":"ROUND(D20-((D20-D17)*(1/3)),3)","v":982.16700000000003},{"$f":"ROUND(E20-((E20-E17)*(1/3)),3)","v":39.423000000000002},14.28,8.69,6.46,5.3029999999999999,4.6029999999999998,4.133,3.8029999999999999,3.5529999999999999,3.363,3.2130000000000001,3.0830000000000002,2.9830000000000001,2.8929999999999998,2.823,2.7530000000000001,2.7029999999999998,2.653,2.6070000000000002,2.5670000000000002,2.5329999999999999,2.5030000000000001,2.4729999999999999,2.4430000000000001,2.423,2.3969999999999998,2.3769999999999998,2.3570000000000002,2.343]
[null,null,15,984.9,39.43,14.25,8.66,6.43,5.27,4.57,4.0999999999999996,3.77,3.52,3.33,3.18,3.05,2.95,2.86,2.79,2.72,2.67,2.62,2.57,2.5299999999999998,2.5,2.4700000000000002,2.44,2.41,2.39,2.36,2.34,2.3199999999999998,2.31]
{"$rows_left_out":16}
{"sheet":"TCrit","index":4,"n_rows":40,"n_cols":2,"rows_kept":40,"cut":false,"hidden":true,"merged":[]}
["Table 39-5 - CRITICAL t-VALUE FOR VERIFICATION OF QUALITY CONTROL TESTING"]
[]
[]
["(for  = 0.025)"]
["(nc+nv-2)","tcrit"]
[]
[1,24.452000000000002]
[2,6.2050000000000001]
[3,4.1769999999999996]
[4,3.4950000000000001]
[5,3.1629999999999998]
[6,2.9689999999999999]
[7,2.8410000000000002]
[8,2.7519999999999998]
[9,2.6850000000000001]
[10,2.6339999999999999]
[11,2.593]
[12,2.56]
[13,2.5329999999999999]
[14,2.5099999999999998]
{"$rows_left_out":21}
{"sheet":"Imported QCData","index":5,"n_rows":56,"n_cols":182,"rows_kept":56,"cut":false,"hidden":true,"merged":[]}
[]
[]
[null,null,"If accepted, data on this sheet will be used to replace the test data on the QCData worksheet"]
[]
[]
[]
[]
[]
[null,"Imported QCData versus Existing QC Data"]
[]
[]
[]
[]
[]
["Instructions: Scroll Down and review highlighted data"]
[]
[null," No Color Change indicates same data as aleady accepted into worksheet."]
[null,"Typically you should only see \"new\" data highlighted blue. Changed or Deleted Data should not be accepted without supporting reason acceptable to the Resident Engineer"]
[null,null,null,null,null,null,null,null,null,null,null,null,null,null,null,null,null,null,null,null,null,null,null,null,null,null,null,null,null,null,null,null,null,null,null,null,null,null,null,null,null,null,null,null,null,null,null,null,null,null,null,null,null,null,null,null,null,null,null,null,null,null,null,null,null,null,null,null,null,null,null,null,null,null,null,null,null,null,null,null,null,null,null,null,null,null,null,null,null,null,null,null,null,null,null,null,null,null,null,null,null,null,null,null,null,null,null,null,null,null,null,null,null,null,null,null,null,null,null,null,null,null,null,null,null,null,null,null,null,null,null,null,null,null,null,null,null,null,null,null,null,null,null,null,null,null,null,null,null,null,null,null,null,null,null,null,"S","<=Indicates same data"]
[null,"Color Coding Legend:",null,null,null,null,null,null,null,null,null,null,null,null,null,null,null,null,null,null,null,null,null,null,null,null,null,null,null,null,null,null,null,null,null,null,null,null,null,null,null,null,null,null,null,null,null,null,null,null,null,null,null,null,null,null,null,null,null,null,null,null,null,null,null,null,null,null,null,null,null,null,null,null,null,null,null,null,null,null,null,null,null,null,null,null,null,null,null,null,null,null,null,null,null,null,null,null,null,null,null,null,null,null,null,null,null,null,null,null,null,null,null,null,null,null,null,null,null,null,null,null,null,null,null,null,null,null,null,null,null,null,null,null,null,null,null,null,null,null,null,null,null,null,null,null,null,null,null,null,null,null,null,null,null,null,"N","<=Indicates new data"]
{"$rows_left_out":37}
{"sheet":"Reconditiondata","index":6,"n_rows":29,"n_cols":29,"rows_kept":29,"cut":false,"hidden":true,"merged":[]}
[]
[]
[]
[]
[]
[]
[]
[]
[]
[]
[]
[]
[]
[]
[]
[]
[]
[]
[]
[]
{"$rows_left_out":10}
{"sheet":"Beta PWL Calculation","index":7,"n_rows":52,"n_cols":16,"rows_kept":52,"cut":false,"hidden":true,"merged":[[0,0,0,9],[21,0,21,15]]}
["1-Sided Beta PWL calculation"]
["Sublot","Test Result","Lot Averge","Lot Standard Deviation","Quality Index (Q)","Number Tests in Lot","d2","x","PWL","LSL"]
["1A1",3850]
["1A2"]
["1B1"]
["1B2"]
["1C1"]
["1C2"]
["1D1"]
["1D2"]
["1E1"]
["1E2",null,{"$f":"AVERAGE(B3:B12)","v":3850},{"$f":"IF(STDEV(B3:B12)<0.001,0.001,STDEV(B3:B12))","v":{"$error":"#DIV/0!"}},{"$f":"(C12-J12)/D12","v":{"$error":"#DIV/0!"}},{"$f":"COUNT(B3:B12)","v":1},{"$f":"SQRT(F12)","v":1},{"$f":"IF(MAX(0,0.5-(E12*G12/(2*(F12-1))))>1,1,MAX(0,0.5-(E12*G12/(2*(F12-1)))))","v":{"$error":"#DIV/0!"}},{"$f":"100-(BETADIST(H12,(F12/2)-1,(F12/2)-1))*100","v":{"$error":"#DIV/0!"}},3000]
[]
[]
[]
[]
[]
[]
[]
[]
{"$rows_left_out":32}